%YAML 1.1
%TAG !u! tag:unity3d.com,2011:
--- !u!21 &2100000
Material:
  serializedVersion: 6
  m_ObjectHideFlags: 0
  m_CorrespondingSourceObject: {fileID: 0}
  m_PrefabInstance: {fileID: 0}
  m_PrefabAsset: {fileID: 0}
  m_Name: M_pine_08
  m_Shader: {fileID: 4800000, guid: 7bd9a74c0a3251f429b6131c73340f07, type: 3}
  m_ShaderKeywords: _ALPHATEST_ON _DISABLE_SSR_TRANSPARENT _DOUBLESIDED_ON
  m_LightmapFlags: 4
  m_EnableInstancingVariants: 1
  m_DoubleSidedGI: 1
  m_CustomRenderQueue: 2475
  stringTagMap:
    MotionVector: User
    RenderType: TransparentCutout
  disabledShaderPasses:
  - TransparentBackface
  - MOTIONVECTORS
  - TransparentDepthPrepass
  - TransparentDepthPostpass
  - RayTracingPrepass
  m_SavedProperties:
    serializedVersion: 3
    m_TexEnvs:
    - WIND_SETTINGS_TexGust:
        m_Texture: {fileID: 0}
        m_Scale: {x: 1, y: 1}
        m_Offset: {x: 0, y: 0}
    - WIND_SETTINGS_TexNoise:
        m_Texture: {fileID: 0}
        m_Scale: {x: 1, y: 1}
        m_Offset: {x: 0, y: 0}
    - _BaseColorMap:
        m_Texture: {fileID: 2800000, guid: 445fbc3857644a145bc8f396e4b3c693, type: 3}
        m_Scale: {x: 1, y: 1}
        m_Offset: {x: 0, y: 0}
    - _BumpMap:
        m_Texture: {fileID: 2800000, guid: 3724a835b6fa46a459b3bb17272ffe9b, type: 3}
        m_Scale: {x: 1, y: 1}
        m_Offset: {x: 0, y: 0}
    - _MainTex:
        m_Texture: {fileID: 2800000, guid: 445fbc3857644a145bc8f396e4b3c693, type: 3}
        m_Scale: {x: 1, y: 1}
        m_Offset: {x: 0, y: 0}
    - _MaskMap:
        m_Texture: {fileID: 0}
        m_Scale: {x: 1, y: 1}
        m_Offset: {x: 0, y: 0}
    - _NormalMap:
        m_Texture: {fileID: 2800000, guid: cb8b2a06f90a2ff41aa7c08ffbc4c1ae, type: 3}
        m_Scale: {x: 1, y: 1}
        m_Offset: {x: 0, y: 0}
    - _ThicknessMap:
        m_Texture: {fileID: 2800000, guid: 05fce0c30212a6049afaf8f7ce6244fa, type: 3}
        m_Scale: {x: 1, y: 1}
        m_Offset: {x: 0, y: 0}
    - _texcoord:
        m_Texture: {fileID: 0}
        m_Scale: {x: 1, y: 1}
        m_Offset: {x: 0, y: 0}
    - unity_Lightmaps:
        m_Texture: {fileID: 0}
        m_Scale: {x: 1, y: 1}
        m_Offset: {x: 0, y: 0}
    - unity_LightmapsInd:
        m_Texture: {fileID: 0}
        m_Scale: {x: 1, y: 1}
        m_Offset: {x: 0, y: 0}
    - unity_ShadowMasks:
        m_Texture: {fileID: 0}
        m_Scale: {x: 1, y: 1}
        m_Offset: {x: 0, y: 0}
    m_Floats:
    - WIND_SETTINGS_FlexNoiseScale: 0
    - WIND_SETTINGS_GustScale: 0
    - WIND_SETTINGS_GustSpeed: 0
    - WIND_SETTINGS_GustWorldScale: 0
    - WIND_SETTINGS_ShiverNoiseScale: 0
    - WIND_SETTINGS_Turbulence: 0
    - _AO: 1
    - _AORemapMax: 1
    - _AORemapMin: 0
    - _AddPrecomputedVelocity: 0
    - _AlphaCutoff: 0.64
    - _AlphaCutoffEnable: 1
    - _AlphaDstBlend: 0
    - _AlphaSrcBlend: 1
    - _AlphaToMask: 0
    - _AlphaToMaskInspectorValue: 0
    - _BlendMode: 0
    - _BumpScale: 1
    - _ColorNoiseSpread: 2
    - _CullFarDistance: 20
    - _CullFarStart: 60
    - _CullMode: 0
    - _CullModeForward: 0
    - _Cutoff: 0.64
    - _DISTANCEBLEND: 0
    - _DepthOffsetEnable: 0
    - _DiffusionProfileHash: 2.6839058
    - _DoubleSidedEnable: 1
    - _DoubleSidedNormalMode: 1
    - _Drag: 0.1
    - _DstBlend: 0
    - _EnableBlendModePreserveSpecularLighting: 1
    - _EnableFogOnTransparent: 1
    - _HeightDrag: 0
    - _InitialBend: 1
    - _NormalScale: 1
    - _OpaqueCullMode: 2
    - _RayTracing: 0
    - _ReceivesSSR: 1
    - _ReceivesSSRTransparent: 0
    - _RefractionModel: 0
    - _RenderQueueType: 1
    - _RequireSplitLighting: 0
    - _ShiverDirectionality: 0
    - _ShiverDrag: 0
    - _Smooothness: 0.1
    - _SmoothnessRemapMax: 0.1
    - _SmoothnessRemapMin: 0
    - _SrcBlend: 1
    - _StencilRef: 0
    - _StencilRefDepth: 8
    - _StencilRefDistortionVec: 4
    - _StencilRefGBuffer: 10
    - _StencilRefMV: 40
    - _StencilWriteMask: 6
    - _StencilWriteMaskDepth: 8
    - _StencilWriteMaskDistortionVec: 4
    - _StencilWriteMaskGBuffer: 14
    - _StencilWriteMaskMV: 40
    - _Stiffness: 0.93
    - _SupportDecals: 1
    - _SurfaceType: 0
    - _Thickness: 1
    - _TouchReactActive: 0
    - _TransparentBackfaceEnable: 0
    - _TransparentCullMode: 2
    - _TransparentDepthPostpassEnable: 0
    - _TransparentDepthPrepassEnable: 0
    - _TransparentSortPriority: 0
    - _TransparentWritingMotionVec: 0
    - _TransparentZWrite: 0
    - _UseShadowThreshold: 0
    - _WINDCOLORMIX: 0
    - _WindColorThreshold: 1
    - _WindNormalInfluence: 0
    - _ZTestDepthEqualForOpaque: 3
    - _ZTestGBuffer: 3
    - _ZTestTransparent: 4
    - _ZWrite: 1
    - __dirty: 1
    m_Colors:
    - WIND_SETTINGS_WorldDirectionAndSpeed: {r: 0, g: 0, b: 0, a: 0}
    - _ColorAdjustment: {r: 1, g: 1, b: 1, a: 0}
    - _DiffusionProfileAsset: {r: 0.0000000018238335, g: 8.720024e-27, b: 0.07043165, a: 1.1969789e-26}
    - _DoubleSidedConstants: {r: 1, g: 1, b: -1, a: 0}
    - _DryColor: {r: 1, g: 1, b: 1, a: 0.5}
    - _EmissionColor: {r: 1, g: 1, b: 1, a: 1}
    - _HealthyColor: {r: 0.8196079, g: 0.8196079, b: 0.8196079, a: 0}
    - _NewNormal: {r: 0, g: 0, b: 0, a: 0}
    - _TilingOffset: {r: 1, g: 1, b: 0, a: 0}
    - _VertexNormalMultiply: {r: 0, g: 0, b: 0, a: 0}
    - _WindColorInfluence: {r: 0, g: 0, b: 0, a: 0}
  m_BuildTextureStacks: []
--- !u!114 &8821899964689021509
MonoBehaviour:
  m_ObjectHideFlags: 11
  m_CorrespondingSourceObject: {fileID: 0}
  m_PrefabInstance: {fileID: 0}
  m_PrefabAsset: {fileID: 0}
  m_GameObject: {fileID: 0}
  m_Enabled: 1
  m_EditorHideFlags: 0
  m_Script: {fileID: 11500000, guid: aa486462e6be1764e89c788ba30e61f7, type: 3}
  m_Name: 
  m_EditorClassIdentifier: 
  m_DiffusionProfileReferences:
  - {fileID: 11400000, guid: 70aafa30c6b72c14783e903d0a166d14, type: 2}
  m_MaterialReferences: []
