%YAML 1.1
%TAG !u! tag:unity3d.com,2011:
--- !u!21 &2100000
Material:
  serializedVersion: 6
  m_ObjectHideFlags: 0
  m_CorrespondingSourceObject: {fileID: 0}
  m_PrefabInstance: {fileID: 0}
  m_PrefabAsset: {fileID: 0}
  m_Name: M_Fir_Bark_06
  m_Shader: {fileID: 4800000, guid: 8a95675767cdff4429e1abe2778a1f30, type: 3}
  m_ShaderKeywords: _DISABLE_SSR_TRANSPARENT _WINDVERTEXCOLORMAINR_ON
  m_LightmapFlags: 4
  m_EnableInstancingVariants: 1
  m_DoubleSidedGI: 0
  m_CustomRenderQueue: 2225
  stringTagMap:
    MotionVector: User
  disabledShaderPasses:
  - MOTIONVECTORS
  - TransparentDepthPrepass
  - TransparentDepthPostpass
  - TransparentBackface
  - RayTracingPrepass
  m_SavedProperties:
    serializedVersion: 3
    m_TexEnvs:
    - _BarkBaseColorMap:
        m_Texture: {fileID: 0}
        m_Scale: {x: 1, y: 1}
        m_Offset: {x: 0, y: 0}
    - _BarkMaskMap:
        m_Texture: {fileID: 0}
        m_Scale: {x: 1, y: 1}
        m_Offset: {x: 0, y: 0}
    - _BarkNormalMap:
        m_Texture: {fileID: 0}
        m_Scale: {x: 1, y: 1}
        m_Offset: {x: 0, y: 0}
    - _BumpMap:
        m_Texture: {fileID: 2800000, guid: 185a425b0d271584189f1262ec793822, type: 3}
        m_Scale: {x: 1, y: 1}
        m_Offset: {x: 0, y: 0}
    - _DetailAlbedoMap:
        m_Texture: {fileID: 0}
        m_Scale: {x: 1, y: 1}
        m_Offset: {x: 0, y: 0}
    - _DetailMask:
        m_Texture: {fileID: 0}
        m_Scale: {x: 1, y: 1}
        m_Offset: {x: 0, y: 0}
    - _DetailMetalicRAOGSmothnessA:
        m_Texture: {fileID: 0}
        m_Scale: {x: 1, y: 1}
        m_Offset: {x: 0, y: 0}
    - _DetailNormalMap:
        m_Texture: {fileID: 0}
        m_Scale: {x: 1, y: 1}
        m_Offset: {x: 0, y: 0}
    - _EmissionMap:
        m_Texture: {fileID: 0}
        m_Scale: {x: 1, y: 1}
        m_Offset: {x: 0, y: 0}
    - _LayerMask:
        m_Texture: {fileID: 0}
        m_Scale: {x: 1, y: 1}
        m_Offset: {x: 0, y: 0}
    - _MainTex:
        m_Texture: {fileID: 2800000, guid: c6bd4f936050748448e190ad994a6b0c, type: 3}
        m_Scale: {x: 1, y: 1}
        m_Offset: {x: 0, y: 0}
    - _MetalicRAOGSmothnessA:
        m_Texture: {fileID: 2800000, guid: 8116f2868fc4f84449a83bc38a7d190b, type: 3}
        m_Scale: {x: 1, y: 1}
        m_Offset: {x: 0, y: 0}
    - _MetallicGlossMap:
        m_Texture: {fileID: 0}
        m_Scale: {x: 1, y: 1}
        m_Offset: {x: 0, y: 0}
    - _OcclusionMap:
        m_Texture: {fileID: 0}
        m_Scale: {x: 1, y: 1}
        m_Offset: {x: 0, y: 0}
    - _ParallaxMap:
        m_Texture: {fileID: 0}
        m_Scale: {x: 1, y: 1}
        m_Offset: {x: 0, y: 0}
    - _TrunkBaseColorMap:
        m_Texture: {fileID: 2800000, guid: c6bd4f936050748448e190ad994a6b0c, type: 3}
        m_Scale: {x: 1, y: 1}
        m_Offset: {x: 0, y: 0}
    - _TrunkMaskMap:
        m_Texture: {fileID: 2800000, guid: 8116f2868fc4f84449a83bc38a7d190b, type: 3}
        m_Scale: {x: 1, y: 1}
        m_Offset: {x: 0, y: 0}
    - _TrunkNormalMap:
        m_Texture: {fileID: 2800000, guid: 185a425b0d271584189f1262ec793822, type: 3}
        m_Scale: {x: 1, y: 1}
        m_Offset: {x: 0, y: 0}
    - _texcoord:
        m_Texture: {fileID: 0}
        m_Scale: {x: 1, y: 1}
        m_Offset: {x: 0, y: 0}
    - _texcoord3:
        m_Texture: {fileID: 0}
        m_Scale: {x: 1, y: 1}
        m_Offset: {x: 0, y: 0}
    - unity_Lightmaps:
        m_Texture: {fileID: 0}
        m_Scale: {x: 1, y: 1}
        m_Offset: {x: 0, y: 0}
    - unity_LightmapsInd:
        m_Texture: {fileID: 0}
        m_Scale: {x: 1, y: 1}
        m_Offset: {x: 0, y: 0}
    - unity_ShadowMasks:
        m_Texture: {fileID: 0}
        m_Scale: {x: 1, y: 1}
        m_Offset: {x: 0, y: 0}
    m_Floats:
    - _AddPrecomputedVelocity: 0
    - _AlphaCutoffEnable: 0
    - _AlphaDstBlend: 0
    - _AlphaSrcBlend: 1
    - _AlphaToMask: 0
    - _AlphaToMaskInspectorValue: 0
    - _AmbientOcclusionPower: 1
    - _BarkAORemapMax: 1
    - _BarkAORemapMin: 0
    - _BarkMetallic: 1
    - _BarkNormalScale: 1
    - _BarkSmoothnessRemapMax: 1
    - _BarkSmoothnessRemapMin: 0
    - _BarkUseUV3: 0
    - _BlendMode: 0
    - _BumpScale: 1
    - _CullMode: 2
    - _CullModeForward: 2
    - _Cutoff: 0.33
    - _DepthOffsetEnable: 0
    - _DetailNormalMapScale: 1
    - _DetalUseUV3: 0
    - _DoubleSidedEnable: 0
    - _DoubleSidedNormalMode: 2
    - _Drag: 0.3
    - _DstBlend: 0
    - _EnableBlendModePreserveSpecularLighting: 1
    - _EnableFogOnTransparent: 1
    - _GlossMapScale: 1
    - _Glossiness: 0.5
    - _GlossyReflections: 1
    - _HeightDrag: 0
    - _InitialBend: 1
    - _MetalicPower: 1
    - _Metallic: 0
    - _MetallicPower: 1
    - _Mode: 0
    - _OcclusionStrength: 1
    - _OpaqueCullMode: 2
    - _Parallax: 0.02
    - _RayTracing: 0
    - _ReceivesSSR: 1
    - _ReceivesSSRTransparent: 0
    - _RefractionModel: 0
    - _RenderQueueType: 1
    - _RequireSplitLighting: 0
    - _SmoothnessPower: 1
    - _SmoothnessTextureChannel: 0
    - _SmothnessPower: 1
    - _SpecularHighlights: 1
    - _SrcBlend: 1
    - _StencilRef: 0
    - _StencilRefDepth: 8
    - _StencilRefDistortionVec: 4
    - _StencilRefGBuffer: 10
    - _StencilRefMV: 40
    - _StencilWriteMask: 6
    - _StencilWriteMaskDepth: 8
    - _StencilWriteMaskDistortionVec: 4
    - _StencilWriteMaskGBuffer: 14
    - _StencilWriteMaskMV: 40
    - _Stiffness: 1
    - _SupportDecals: 1
    - _SurfaceType: 0
    - _TransAmbient: 0.184
    - _TransDirect: 1
    - _TransNormalDistortion: 0
    - _TransScattering: 1
    - _TransShadow: 0.34
    - _Translucency: 17.4
    - _TransparentBackfaceEnable: 0
    - _TransparentCullMode: 2
    - _TransparentDepthPostpassEnable: 0
    - _TransparentDepthPrepassEnable: 0
    - _TransparentSortPriority: 0
    - _TransparentWritingMotionVec: 0
    - _TransparentZWrite: 0
    - _TrunkAORemapMax: 1
    - _TrunkAORemapMin: 0
    - _TrunkMetallic: 1
    - _TrunkNormalScale: 1
    - _TrunkSmoothnessRemapMax: 1
    - _TrunkSmoothnessRemapMin: 0
    - _UVSec: 0
    - _UseShadowThreshold: 0
    - _WindNoisePower: 0
    - _WindPower: 0.25
    - _WindPowerDirectionX: 1
    - _WindPowerDirectionZ: 0.3
    - _WindVertexColorMainR: 1
    - _WindVertexColorMainRNoiseB: 0
    - _ZTestDepthEqualForOpaque: 3
    - _ZTestGBuffer: 4
    - _ZTestTransparent: 4
    - _ZWrite: 1
    - __dirty: 0
    m_Colors:
    - _BarkBaseColor: {r: 1, g: 1, b: 1, a: 0}
    - _BarkBlendMaskTilingOffset: {r: 1, g: 1, b: 0, a: 0}
    - _BarkTilingOffset: {r: 1, g: 1, b: 0, a: 0}
    - _Color: {r: 1, g: 1, b: 1, a: 1}
    - _DoubleSidedConstants: {r: 1, g: 1, b: -1, a: 0}
    - _EmissionColor: {r: 1, g: 1, b: 1, a: 1}
    - _NewNormal: {r: 0, g: 0, b: 0, a: 0}
    - _TranslucencyColor: {r: 0.39069322, g: 0.4705882, b: 0.283737, a: 0}
    - _TrunkBaseColor: {r: 1, g: 1, b: 1, a: 0}
    - _TrunkTilingOffset: {r: 1, g: 1, b: 0, a: 0}
    - _WindColorMultiply: {r: 1, g: 1, b: 1, a: 0}
  m_BuildTextureStacks: []
