{
    "m_SGVersion": 3,
    "m_Type": "UnityEditor.ShaderGraph.GraphData",
    "m_ObjectId": "6e71402b08b948c1a7fa4e0ef2dee4dd",
    "m_Properties": [
        {
            "m_Id": "8ecf2c57dea847fb8e954b231d4ff442"
        },
        {
            "m_Id": "0ca032b223584ea4a3f341cffa4915e6"
        },
        {
            "m_Id": "e32d27c10f744cf9bf01478f30d011cd"
        },
        {
            "m_Id": "009d52f731424eb78b450c2173715b64"
        },
        {
            "m_Id": "416ade29a38846d8a10c9c1e061e3b7c"
        },
        {
            "m_Id": "1c047991ec30462ead078bcde38624e3"
        },
        {
            "m_Id": "04af916c38e7472fb640853268d0b2c8"
        },
        {
            "m_Id": "2b31e4f0cd7d4212b78c7be2ac51158e"
        },
        {
            "m_Id": "74cf7903c2eb48338dc2113ca2e145c9"
        },
        {
            "m_Id": "b64538fa235b438ebc19d8872c631822"
        },
        {
            "m_Id": "ba9fea1b32ff4f1a901101c48408d9e7"
        },
        {
            "m_Id": "fee13a0a9aac44439ebf7d111c0ef30f"
        },
        {
            "m_Id": "fffe2b7808e94161a2e3ee6cb42fd55b"
        }
    ],
    "m_Keywords": [],
    "m_CategoryData": [],
    "m_Nodes": [
        {
            "m_Id": "2debc2f759de44598862c484fdf0795e"
        },
        {
            "m_Id": "da1511a6e0ba4d29aa82297fca79d452"
        },
        {
            "m_Id": "29517d069f374f6da42e2bde2228e311"
        },
        {
            "m_Id": "0bae783369514210a449c67eb07aab63"
        },
        {
            "m_Id": "0268708a7a654a6d872232ba65e284bf"
        },
        {
            "m_Id": "2089f237775642639b312b1e8a298e17"
        },
        {
            "m_Id": "5184eab4605a4178b1e242794655da3d"
        },
        {
            "m_Id": "ed2444fbd3924f0cb980047b738e7afd"
        },
        {
            "m_Id": "affb26afbcdb4da3822848429dfc0e14"
        },
        {
            "m_Id": "4322b951c9db4a62a9d7ed121ed4f118"
        },
        {
            "m_Id": "58e7c2c06118472bbe2e714f9c780100"
        },
        {
            "m_Id": "be9c571faa6d4c6db3ffabc4ca681ab8"
        },
        {
            "m_Id": "22cce63cc1c749f1abf79bc7287f189f"
        },
        {
            "m_Id": "b731f66229b94be185c05786d5f6d541"
        },
        {
            "m_Id": "6dc9efa869b44b43a9ed5905365d0d36"
        },
        {
            "m_Id": "8838defad18f44b08b90dd61bf46bea0"
        },
        {
            "m_Id": "367bcd8ae7bd4eb89f6da02185b8fc0f"
        },
        {
            "m_Id": "9b55e83d5bc94764badea4a8e05db034"
        }
    ],
    "m_GroupDatas": [],
    "m_StickyNoteDatas": [],
    "m_Edges": [
        {
            "m_OutputSlot": {
                "m_Node": {
                    "m_Id": "0268708a7a654a6d872232ba65e284bf"
                },
                "m_SlotId": 0
            },
            "m_InputSlot": {
                "m_Node": {
                    "m_Id": "da1511a6e0ba4d29aa82297fca79d452"
                },
                "m_SlotId": 1931610134
            }
        },
        {
            "m_OutputSlot": {
                "m_Node": {
                    "m_Id": "0bae783369514210a449c67eb07aab63"
                },
                "m_SlotId": 1
            },
            "m_InputSlot": {
                "m_Node": {
                    "m_Id": "2debc2f759de44598862c484fdf0795e"
                },
                "m_SlotId": 7
            }
        },
        {
            "m_OutputSlot": {
                "m_Node": {
                    "m_Id": "2089f237775642639b312b1e8a298e17"
                },
                "m_SlotId": 0
            },
            "m_InputSlot": {
                "m_Node": {
                    "m_Id": "0bae783369514210a449c67eb07aab63"
                },
                "m_SlotId": -861317959
            }
        },
        {
            "m_OutputSlot": {
                "m_Node": {
                    "m_Id": "2089f237775642639b312b1e8a298e17"
                },
                "m_SlotId": 0
            },
            "m_InputSlot": {
                "m_Node": {
                    "m_Id": "29517d069f374f6da42e2bde2228e311"
                },
                "m_SlotId": -1224440130
            }
        },
        {
            "m_OutputSlot": {
                "m_Node": {
                    "m_Id": "2089f237775642639b312b1e8a298e17"
                },
                "m_SlotId": 0
            },
            "m_InputSlot": {
                "m_Node": {
                    "m_Id": "9b55e83d5bc94764badea4a8e05db034"
                },
                "m_SlotId": -861317959
            }
        },
        {
            "m_OutputSlot": {
                "m_Node": {
                    "m_Id": "2089f237775642639b312b1e8a298e17"
                },
                "m_SlotId": 0
            },
            "m_InputSlot": {
                "m_Node": {
                    "m_Id": "da1511a6e0ba4d29aa82297fca79d452"
                },
                "m_SlotId": 1635626871
            }
        },
        {
            "m_OutputSlot": {
                "m_Node": {
                    "m_Id": "22cce63cc1c749f1abf79bc7287f189f"
                },
                "m_SlotId": 0
            },
            "m_InputSlot": {
                "m_Node": {
                    "m_Id": "29517d069f374f6da42e2bde2228e311"
                },
                "m_SlotId": 1076824718
            }
        },
        {
            "m_OutputSlot": {
                "m_Node": {
                    "m_Id": "29517d069f374f6da42e2bde2228e311"
                },
                "m_SlotId": 1
            },
            "m_InputSlot": {
                "m_Node": {
                    "m_Id": "2debc2f759de44598862c484fdf0795e"
                },
                "m_SlotId": 5
            }
        },
        {
            "m_OutputSlot": {
                "m_Node": {
                    "m_Id": "29517d069f374f6da42e2bde2228e311"
                },
                "m_SlotId": 2
            },
            "m_InputSlot": {
                "m_Node": {
                    "m_Id": "2debc2f759de44598862c484fdf0795e"
                },
                "m_SlotId": 6
            }
        },
        {
            "m_OutputSlot": {
                "m_Node": {
                    "m_Id": "367bcd8ae7bd4eb89f6da02185b8fc0f"
                },
                "m_SlotId": 0
            },
            "m_InputSlot": {
                "m_Node": {
                    "m_Id": "9b55e83d5bc94764badea4a8e05db034"
                },
                "m_SlotId": 1594186760
            }
        },
        {
            "m_OutputSlot": {
                "m_Node": {
                    "m_Id": "4322b951c9db4a62a9d7ed121ed4f118"
                },
                "m_SlotId": 0
            },
            "m_InputSlot": {
                "m_Node": {
                    "m_Id": "da1511a6e0ba4d29aa82297fca79d452"
                },
                "m_SlotId": 1394961470
            }
        },
        {
            "m_OutputSlot": {
                "m_Node": {
                    "m_Id": "5184eab4605a4178b1e242794655da3d"
                },
                "m_SlotId": 0
            },
            "m_InputSlot": {
                "m_Node": {
                    "m_Id": "da1511a6e0ba4d29aa82297fca79d452"
                },
                "m_SlotId": -411688495
            }
        },
        {
            "m_OutputSlot": {
                "m_Node": {
                    "m_Id": "58e7c2c06118472bbe2e714f9c780100"
                },
                "m_SlotId": 0
            },
            "m_InputSlot": {
                "m_Node": {
                    "m_Id": "da1511a6e0ba4d29aa82297fca79d452"
                },
                "m_SlotId": -1085397827
            }
        },
        {
            "m_OutputSlot": {
                "m_Node": {
                    "m_Id": "6dc9efa869b44b43a9ed5905365d0d36"
                },
                "m_SlotId": 0
            },
            "m_InputSlot": {
                "m_Node": {
                    "m_Id": "0bae783369514210a449c67eb07aab63"
                },
                "m_SlotId": 1594186760
            }
        },
        {
            "m_OutputSlot": {
                "m_Node": {
                    "m_Id": "8838defad18f44b08b90dd61bf46bea0"
                },
                "m_SlotId": 0
            },
            "m_InputSlot": {
                "m_Node": {
                    "m_Id": "0bae783369514210a449c67eb07aab63"
                },
                "m_SlotId": 712926054
            }
        },
        {
            "m_OutputSlot": {
                "m_Node": {
                    "m_Id": "8838defad18f44b08b90dd61bf46bea0"
                },
                "m_SlotId": 0
            },
            "m_InputSlot": {
                "m_Node": {
                    "m_Id": "9b55e83d5bc94764badea4a8e05db034"
                },
                "m_SlotId": 712926054
            }
        },
        {
            "m_OutputSlot": {
                "m_Node": {
                    "m_Id": "9b55e83d5bc94764badea4a8e05db034"
                },
                "m_SlotId": 1
            },
            "m_InputSlot": {
                "m_Node": {
                    "m_Id": "2debc2f759de44598862c484fdf0795e"
                },
                "m_SlotId": 8
            }
        },
        {
            "m_OutputSlot": {
                "m_Node": {
                    "m_Id": "affb26afbcdb4da3822848429dfc0e14"
                },
                "m_SlotId": 0
            },
            "m_InputSlot": {
                "m_Node": {
                    "m_Id": "da1511a6e0ba4d29aa82297fca79d452"
                },
                "m_SlotId": -875770945
            }
        },
        {
            "m_OutputSlot": {
                "m_Node": {
                    "m_Id": "b731f66229b94be185c05786d5f6d541"
                },
                "m_SlotId": 0
            },
            "m_InputSlot": {
                "m_Node": {
                    "m_Id": "29517d069f374f6da42e2bde2228e311"
                },
                "m_SlotId": -211304638
            }
        },
        {
            "m_OutputSlot": {
                "m_Node": {
                    "m_Id": "be9c571faa6d4c6db3ffabc4ca681ab8"
                },
                "m_SlotId": 0
            },
            "m_InputSlot": {
                "m_Node": {
                    "m_Id": "da1511a6e0ba4d29aa82297fca79d452"
                },
                "m_SlotId": 213700010
            }
        },
        {
            "m_OutputSlot": {
                "m_Node": {
                    "m_Id": "da1511a6e0ba4d29aa82297fca79d452"
                },
                "m_SlotId": 1
            },
            "m_InputSlot": {
                "m_Node": {
                    "m_Id": "2debc2f759de44598862c484fdf0795e"
                },
                "m_SlotId": 1
            }
        },
        {
            "m_OutputSlot": {
                "m_Node": {
                    "m_Id": "da1511a6e0ba4d29aa82297fca79d452"
                },
                "m_SlotId": 2
            },
            "m_InputSlot": {
                "m_Node": {
                    "m_Id": "2debc2f759de44598862c484fdf0795e"
                },
                "m_SlotId": 2
            }
        },
        {
            "m_OutputSlot": {
                "m_Node": {
                    "m_Id": "da1511a6e0ba4d29aa82297fca79d452"
                },
                "m_SlotId": 3
            },
            "m_InputSlot": {
                "m_Node": {
                    "m_Id": "2debc2f759de44598862c484fdf0795e"
                },
                "m_SlotId": 3
            }
        },
        {
            "m_OutputSlot": {
                "m_Node": {
                    "m_Id": "da1511a6e0ba4d29aa82297fca79d452"
                },
                "m_SlotId": 4
            },
            "m_InputSlot": {
                "m_Node": {
                    "m_Id": "2debc2f759de44598862c484fdf0795e"
                },
                "m_SlotId": 4
            }
        },
        {
            "m_OutputSlot": {
                "m_Node": {
                    "m_Id": "ed2444fbd3924f0cb980047b738e7afd"
                },
                "m_SlotId": 0
            },
            "m_InputSlot": {
                "m_Node": {
                    "m_Id": "da1511a6e0ba4d29aa82297fca79d452"
                },
                "m_SlotId": -575159138
            }
        }
    ],
    "m_VertexContext": {
        "m_Position": {
            "x": 0.0,
            "y": 0.0
        },
        "m_Blocks": []
    },
    "m_FragmentContext": {
        "m_Position": {
            "x": 0.0,
            "y": 0.0
        },
        "m_Blocks": []
    },
    "m_PreviewData": {
        "serializedMesh": {
            "m_SerializedMesh": "{\"mesh\":{\"instanceID\":0}}",
            "m_Guid": ""
        }
    },
    "m_Path": "Sub Graphs",
    "m_GraphPrecision": 0,
    "m_PreviewMode": 2,
    "m_OutputNode": {
        "m_Id": "2debc2f759de44598862c484fdf0795e"
    },
    "m_ActiveTargets": []
}

{
    "m_SGVersion": 0,
    "m_Type": "UnityEditor.ShaderGraph.Vector1MaterialSlot",
    "m_ObjectId": "003e25223f5a48598134e5826774707c",
    "m_Id": 712926054,
    "m_DisplayName": "Normal Strength",
    "m_SlotType": 0,
    "m_Hidden": false,
    "m_ShaderOutputName": "Vector1_308AAC4B",
    "m_StageCapability": 2,
    "m_Value": 1.0,
    "m_DefaultValue": 0.0,
    "m_Labels": [
        "X"
    ]
}

{
    "m_SGVersion": 0,
    "m_Type": "UnityEditor.ShaderGraph.Vector3MaterialSlot",
    "m_ObjectId": "00554d9f30384ec2a6c84790f3741fa7",
    "m_Id": 5,
    "m_DisplayName": "BaseColor",
    "m_SlotType": 0,
    "m_Hidden": false,
    "m_ShaderOutputName": "BaseColor",
    "m_StageCapability": 2,
    "m_Value": {
        "x": 0.0,
        "y": 0.0,
        "z": 0.0
    },
    "m_DefaultValue": {
        "x": 0.0,
        "y": 0.0,
        "z": 0.0
    },
    "m_Labels": []
}

{
    "m_SGVersion": 0,
    "m_Type": "UnityEditor.ShaderGraph.Texture2DInputMaterialSlot",
    "m_ObjectId": "00940210b3894ddd973358cf67bc2aaf",
    "m_Id": 1594186760,
    "m_DisplayName": "Normal Map",
    "m_SlotType": 0,
    "m_Hidden": false,
    "m_ShaderOutputName": "Texture2D_E149C56E",
    "m_StageCapability": 2,
    "m_BareResource": false,
    "m_Texture": {
        "m_SerializedTexture": "{\"texture\":{\"instanceID\":0}}",
        "m_Guid": ""
    },
    "m_DefaultType": 0
}

{
    "m_SGVersion": 1,
    "m_Type": "UnityEditor.ShaderGraph.Internal.Vector1ShaderProperty",
    "m_ObjectId": "009d52f731424eb78b450c2173715b64",
    "m_Guid": {
        "m_GuidSerialized": "f94acd19-4de2-4857-89cc-9fb0952e4f9e"
    },
    "m_Name": "Metallic",
    "m_DefaultRefNameVersion": 0,
    "m_RefNameGeneratedByDisplayName": "",
    "m_DefaultReferenceName": "Vector1_009d52f731424eb78b450c2173715b64",
    "m_OverrideReferenceName": "",
    "m_GeneratePropertyBlock": true,
    "m_Precision": 0,
    "overrideHLSLDeclaration": false,
    "hlslDeclarationOverride": 0,
    "m_Hidden": false,
    "m_Value": 0.0,
    "m_FloatType": 0,
    "m_RangeValues": {
        "x": 0.0,
        "y": 1.0
    }
}

{
    "m_SGVersion": 0,
    "m_Type": "UnityEditor.ShaderGraph.PropertyNode",
    "m_ObjectId": "0268708a7a654a6d872232ba65e284bf",
    "m_Group": {
        "m_Id": ""
    },
    "m_Name": "Property",
    "m_DrawState": {
        "m_Expanded": true,
        "m_Position": {
            "serializedVersion": "2",
            "x": -276.7499084472656,
            "y": -24.499984741210939,
            "width": 0.0,
            "height": 0.0
        }
    },
    "m_Slots": [
        {
            "m_Id": "bd157931e1a14a9cbb92532981bf0dc5"
        }
    ],
    "synonyms": [],
    "m_Precision": 0,
    "m_PreviewExpanded": true,
    "m_PreviewMode": 0,
    "m_CustomColors": {
        "m_SerializableColors": []
    },
    "m_Property": {
        "m_Id": "e32d27c10f744cf9bf01478f30d011cd"
    }
}

{
    "m_SGVersion": 0,
    "m_Type": "UnityEditor.ShaderGraph.Texture2DMaterialSlot",
    "m_ObjectId": "0498b5d5fffd4efe87ccb676ce2d6bba",
    "m_Id": 0,
    "m_DisplayName": "Bent Normal Map",
    "m_SlotType": 1,
    "m_Hidden": false,
    "m_ShaderOutputName": "Out",
    "m_StageCapability": 3,
    "m_BareResource": false
}

{
    "m_SGVersion": 1,
    "m_Type": "UnityEditor.ShaderGraph.Internal.Vector1ShaderProperty",
    "m_ObjectId": "04af916c38e7472fb640853268d0b2c8",
    "m_Guid": {
        "m_GuidSerialized": "1cfc455d-7399-4192-afbf-fb1b98d56e99"
    },
    "m_Name": "Coat Mask",
    "m_DefaultRefNameVersion": 0,
    "m_RefNameGeneratedByDisplayName": "",
    "m_DefaultReferenceName": "Vector1_04af916c38e7472fb640853268d0b2c8",
    "m_OverrideReferenceName": "",
    "m_GeneratePropertyBlock": true,
    "m_Precision": 0,
    "overrideHLSLDeclaration": false,
    "hlslDeclarationOverride": 0,
    "m_Hidden": false,
    "m_Value": 0.0,
    "m_FloatType": 0,
    "m_RangeValues": {
        "x": 0.0,
        "y": 1.0
    }
}

{
    "m_SGVersion": 0,
    "m_Type": "UnityEditor.ShaderGraph.Vector1MaterialSlot",
    "m_ObjectId": "06ad01f186e44fb89d594b6865725a95",
    "m_Id": -411688495,
    "m_DisplayName": "Metallic",
    "m_SlotType": 0,
    "m_Hidden": false,
    "m_ShaderOutputName": "Vector1_D10A04B2",
    "m_StageCapability": 2,
    "m_Value": 1.0,
    "m_DefaultValue": 0.0,
    "m_Labels": [
        "X"
    ]
}

{
    "m_SGVersion": 0,
    "m_Type": "UnityEditor.ShaderGraph.SubGraphNode",
    "m_ObjectId": "0bae783369514210a449c67eb07aab63",
    "m_Group": {
        "m_Id": ""
    },
    "m_Name": "SG Base Normal",
    "m_DrawState": {
        "m_Expanded": true,
        "m_Position": {
            "serializedVersion": "2",
            "x": -90.0000228881836,
            "y": 237.0,
            "width": 226.99998474121095,
            "height": 142.0
        }
    },
    "m_Slots": [
        {
            "m_Id": "29f3d348b2da4bfaab8de8090daab5e5"
        },
        {
            "m_Id": "003e25223f5a48598134e5826774707c"
        },
        {
            "m_Id": "b9841bf8531b4d42bc0764e78942aa8d"
        },
        {
            "m_Id": "60d4f350240243649b784fdbe53be455"
        }
    ],
    "synonyms": [],
    "m_Precision": 0,
    "m_PreviewExpanded": false,
    "m_PreviewMode": 0,
    "m_CustomColors": {
        "m_SerializableColors": []
    },
    "m_SerializedSubGraph": "{\n    \"subGraph\": {\n        \"fileID\": -5475051401550479605,\n        \"guid\": \"86f2ce8a34cd57d4988a60cd7adbe228\",\n        \"type\": 3\n    }\n}",
    "m_PropertyGuids": [
        "8a8e1fec-278b-434d-a1c2-f21445c776a9",
        "46b32ba0-99cd-486a-b744-f506ab3ba5ac",
        "9296126e-333f-463d-82c7-6d66f936b4ea"
    ],
    "m_PropertyIds": [
        1594186760,
        712926054,
        -861317959
    ]
}

{
    "m_SGVersion": 1,
    "m_Type": "UnityEditor.ShaderGraph.Internal.Vector4ShaderProperty",
    "m_ObjectId": "0ca032b223584ea4a3f341cffa4915e6",
    "m_Guid": {
        "m_GuidSerialized": "3f859f29-47ab-4cad-91f9-9ad45d07038f"
    },
    "m_Name": "Base Color",
    "m_DefaultRefNameVersion": 0,
    "m_RefNameGeneratedByDisplayName": "",
    "m_DefaultReferenceName": "Vector4_0ca032b223584ea4a3f341cffa4915e6",
    "m_OverrideReferenceName": "",
    "m_GeneratePropertyBlock": true,
    "m_Precision": 0,
    "overrideHLSLDeclaration": false,
    "hlslDeclarationOverride": 0,
    "m_Hidden": false,
    "m_Value": {
        "x": 0.0,
        "y": 0.0,
        "z": 0.0,
        "w": 0.0
    }
}

{
    "m_SGVersion": 0,
    "m_Type": "UnityEditor.ShaderGraph.Vector1MaterialSlot",
    "m_ObjectId": "108d11e6fd7c4d73a676495ce932c204",
    "m_Id": 1394961470,
    "m_DisplayName": "Coat Mask",
    "m_SlotType": 0,
    "m_Hidden": false,
    "m_ShaderOutputName": "Vector1_44C89FA5",
    "m_StageCapability": 2,
    "m_Value": 1.0,
    "m_DefaultValue": 0.0,
    "m_Labels": [
        "X"
    ]
}

{
    "m_SGVersion": 0,
    "m_Type": "UnityEditor.ShaderGraph.Vector1MaterialSlot",
    "m_ObjectId": "180f2c5991de4d4fb7767047ae03a1e5",
    "m_Id": 1,
    "m_DisplayName": "Metallic",
    "m_SlotType": 0,
    "m_Hidden": false,
    "m_ShaderOutputName": "Metallic",
    "m_StageCapability": 2,
    "m_Value": 0.0,
    "m_DefaultValue": 0.0,
    "m_Labels": []
}

{
    "m_SGVersion": 1,
    "m_Type": "UnityEditor.ShaderGraph.Internal.Vector1ShaderProperty",
    "m_ObjectId": "1c047991ec30462ead078bcde38624e3",
    "m_Guid": {
        "m_GuidSerialized": "bf4afc03-75b4-493a-9340-5640936bff7a"
    },
    "m_Name": "AO Remap Max",
    "m_DefaultRefNameVersion": 0,
    "m_RefNameGeneratedByDisplayName": "",
    "m_DefaultReferenceName": "Vector1_1c047991ec30462ead078bcde38624e3",
    "m_OverrideReferenceName": "",
    "m_GeneratePropertyBlock": true,
    "m_Precision": 0,
    "overrideHLSLDeclaration": false,
    "hlslDeclarationOverride": 0,
    "m_Hidden": false,
    "m_Value": 0.0,
    "m_FloatType": 0,
    "m_RangeValues": {
        "x": 0.0,
        "y": 1.0
    }
}

{
    "m_SGVersion": 0,
    "m_Type": "UnityEditor.ShaderGraph.PropertyNode",
    "m_ObjectId": "2089f237775642639b312b1e8a298e17",
    "m_Group": {
        "m_Id": ""
    },
    "m_Name": "Property",
    "m_DrawState": {
        "m_Expanded": true,
        "m_Position": {
            "serializedVersion": "2",
            "x": -675.0,
            "y": -110.0,
            "width": 93.0,
            "height": 34.0
        }
    },
    "m_Slots": [
        {
            "m_Id": "28105ca919b841ceb6ca905a1b5a69d8"
        }
    ],
    "synonyms": [],
    "m_Precision": 0,
    "m_PreviewExpanded": true,
    "m_PreviewMode": 0,
    "m_CustomColors": {
        "m_SerializableColors": []
    },
    "m_Property": {
        "m_Id": "fffe2b7808e94161a2e3ee6cb42fd55b"
    }
}

{
    "m_SGVersion": 0,
    "m_Type": "UnityEditor.ShaderGraph.PropertyNode",
    "m_ObjectId": "22cce63cc1c749f1abf79bc7287f189f",
    "m_Group": {
        "m_Id": ""
    },
    "m_Name": "Property",
    "m_DrawState": {
        "m_Expanded": true,
        "m_Position": {
            "serializedVersion": "2",
            "x": -339.0,
            "y": -488.0,
            "width": 166.0,
            "height": 34.0
        }
    },
    "m_Slots": [
        {
            "m_Id": "ae0822b65dbb491689cc80f717d206a2"
        }
    ],
    "synonyms": [],
    "m_Precision": 0,
    "m_PreviewExpanded": true,
    "m_PreviewMode": 0,
    "m_CustomColors": {
        "m_SerializableColors": []
    },
    "m_Property": {
        "m_Id": "8ecf2c57dea847fb8e954b231d4ff442"
    }
}

{
    "m_SGVersion": 0,
    "m_Type": "UnityEditor.ShaderGraph.Vector2MaterialSlot",
    "m_ObjectId": "28105ca919b841ceb6ca905a1b5a69d8",
    "m_Id": 0,
    "m_DisplayName": "UV",
    "m_SlotType": 1,
    "m_Hidden": false,
    "m_ShaderOutputName": "Out",
    "m_StageCapability": 3,
    "m_Value": {
        "x": 0.0,
        "y": 0.0
    },
    "m_DefaultValue": {
        "x": 0.0,
        "y": 0.0
    },
    "m_Labels": []
}

{
    "m_SGVersion": 0,
    "m_Type": "UnityEditor.ShaderGraph.SubGraphNode",
    "m_ObjectId": "29517d069f374f6da42e2bde2228e311",
    "m_Group": {
        "m_Id": ""
    },
    "m_Name": "SG Base Color",
    "m_DrawState": {
        "m_Expanded": true,
        "m_Position": {
            "serializedVersion": "2",
            "x": -126.75007629394531,
            "y": -519.5,
            "width": 217.0,
            "height": 326.0
        }
    },
    "m_Slots": [
        {
            "m_Id": "5c3da8957fc747db88cdfcda8aec353e"
        },
        {
            "m_Id": "55df0ec9f2384942b7c80b521a09808d"
        },
        {
            "m_Id": "8124db1bb63a4ef69185708cdc5314a7"
        },
        {
            "m_Id": "b229a5b33f6d42d289cb1e4e760e9f31"
        },
        {
            "m_Id": "a141bf552d754dc9a99a09afed296221"
        }
    ],
    "synonyms": [],
    "m_Precision": 0,
    "m_PreviewExpanded": false,
    "m_PreviewMode": 0,
    "m_CustomColors": {
        "m_SerializableColors": []
    },
    "m_SerializedSubGraph": "{\n    \"subGraph\": {\n        \"fileID\": -5475051401550479605,\n        \"guid\": \"8fa9c64c98f58fa4aaf3eee790b56ccc\",\n        \"type\": 3\n    }\n}",
    "m_PropertyGuids": [
        "56954d1c-8fba-4733-83f0-99178767c6a1",
        "a4a0f209-3cc7-4d5d-a956-6ba5bd15ec16",
        "09b1cf90-81b5-4990-8932-3f60eb6e22be"
    ],
    "m_PropertyIds": [
        1076824718,
        -211304638,
        -1224440130
    ]
}

{
    "m_SGVersion": 0,
    "m_Type": "UnityEditor.ShaderGraph.Texture2DInputMaterialSlot",
    "m_ObjectId": "29f3d348b2da4bfaab8de8090daab5e5",
    "m_Id": 1594186760,
    "m_DisplayName": "Normal Map",
    "m_SlotType": 0,
    "m_Hidden": false,
    "m_ShaderOutputName": "Texture2D_E149C56E",
    "m_StageCapability": 2,
    "m_BareResource": false,
    "m_Texture": {
        "m_SerializedTexture": "{\"texture\":{\"instanceID\":0}}",
        "m_Guid": ""
    },
    "m_DefaultType": 0
}

{
    "m_SGVersion": 1,
    "m_Type": "UnityEditor.ShaderGraph.Internal.Vector1ShaderProperty",
    "m_ObjectId": "2b31e4f0cd7d4212b78c7be2ac51158e",
    "m_Guid": {
        "m_GuidSerialized": "4730f02a-9b75-4199-8dcd-6d640dfaba18"
    },
    "m_Name": "Smoothness Remap Min",
    "m_DefaultRefNameVersion": 0,
    "m_RefNameGeneratedByDisplayName": "",
    "m_DefaultReferenceName": "Vector1_2b31e4f0cd7d4212b78c7be2ac51158e",
    "m_OverrideReferenceName": "",
    "m_GeneratePropertyBlock": true,
    "m_Precision": 0,
    "overrideHLSLDeclaration": false,
    "hlslDeclarationOverride": 0,
    "m_Hidden": false,
    "m_Value": 0.0,
    "m_FloatType": 0,
    "m_RangeValues": {
        "x": 0.0,
        "y": 1.0
    }
}

{
    "m_SGVersion": 0,
    "m_Type": "UnityEditor.ShaderGraph.Vector1MaterialSlot",
    "m_ObjectId": "2dba47b5c3754bbfa808eceee9262697",
    "m_Id": 3,
    "m_DisplayName": "CoatMask",
    "m_SlotType": 0,
    "m_Hidden": false,
    "m_ShaderOutputName": "CoatMask",
    "m_StageCapability": 2,
    "m_Value": 0.0,
    "m_DefaultValue": 0.0,
    "m_Labels": []
}

{
    "m_SGVersion": 0,
    "m_Type": "UnityEditor.ShaderGraph.SubGraphOutputNode",
    "m_ObjectId": "2debc2f759de44598862c484fdf0795e",
    "m_Group": {
        "m_Id": ""
    },
    "m_Name": "Output",
    "m_DrawState": {
        "m_Expanded": true,
        "m_Position": {
            "serializedVersion": "2",
            "x": 353.0000305175781,
            "y": -245.0,
            "width": 148.0,
            "height": 221.00001525878907
        }
    },
    "m_Slots": [
        {
            "m_Id": "00554d9f30384ec2a6c84790f3741fa7"
        },
        {
            "m_Id": "180f2c5991de4d4fb7767047ae03a1e5"
        },
        {
            "m_Id": "6deba1f8ca314729bf6c030128d90a30"
        },
        {
            "m_Id": "2dba47b5c3754bbfa808eceee9262697"
        },
        {
            "m_Id": "7b4b51332b74465c8f3779f7501ec071"
        },
        {
            "m_Id": "e211a1a847b24ba1ae1f8b8eb52f72d9"
        },
        {
            "m_Id": "baf058d1ea144c7cacd5374339f16b52"
        },
        {
            "m_Id": "a43640c377324eda975cce089e0f0811"
        }
    ],
    "synonyms": [],
    "m_Precision": 0,
    "m_PreviewExpanded": true,
    "m_PreviewMode": 0,
    "m_CustomColors": {
        "m_SerializableColors": []
    },
    "IsFirstSlotValid": true
}

{
    "m_SGVersion": 0,
    "m_Type": "UnityEditor.ShaderGraph.Vector1MaterialSlot",
    "m_ObjectId": "362c50058efb4033aa67062eaccb98c6",
    "m_Id": 4,
    "m_DisplayName": "Smoothness",
    "m_SlotType": 1,
    "m_Hidden": false,
    "m_ShaderOutputName": "Smoothness",
    "m_StageCapability": 2,
    "m_Value": 0.0,
    "m_DefaultValue": 0.0,
    "m_Labels": [
        "X"
    ]
}

{
    "m_SGVersion": 0,
    "m_Type": "UnityEditor.ShaderGraph.PropertyNode",
    "m_ObjectId": "367bcd8ae7bd4eb89f6da02185b8fc0f",
    "m_Group": {
        "m_Id": ""
    },
    "m_Name": "Property",
    "m_DrawState": {
        "m_Expanded": true,
        "m_Position": {
            "serializedVersion": "2",
            "x": -339.0,
            "y": 476.0,
            "width": 174.0,
            "height": 34.0
        }
    },
    "m_Slots": [
        {
            "m_Id": "0498b5d5fffd4efe87ccb676ce2d6bba"
        }
    ],
    "synonyms": [],
    "m_Precision": 0,
    "m_PreviewExpanded": true,
    "m_PreviewMode": 0,
    "m_CustomColors": {
        "m_SerializableColors": []
    },
    "m_Property": {
        "m_Id": "fee13a0a9aac44439ebf7d111c0ef30f"
    }
}

{
    "m_SGVersion": 0,
    "m_Type": "UnityEditor.ShaderGraph.Vector1MaterialSlot",
    "m_ObjectId": "385dd29188954b069d2fa77e984c0898",
    "m_Id": 3,
    "m_DisplayName": "CoatMask",
    "m_SlotType": 1,
    "m_Hidden": false,
    "m_ShaderOutputName": "CoatMask",
    "m_StageCapability": 2,
    "m_Value": 0.0,
    "m_DefaultValue": 0.0,
    "m_Labels": [
        "X"
    ]
}

{
    "m_SGVersion": 1,
    "m_Type": "UnityEditor.ShaderGraph.Internal.Vector1ShaderProperty",
    "m_ObjectId": "416ade29a38846d8a10c9c1e061e3b7c",
    "m_Guid": {
        "m_GuidSerialized": "568e0657-83c1-4697-ad3a-910b032e503f"
    },
    "m_Name": "AO Remap Min",
    "m_DefaultRefNameVersion": 0,
    "m_RefNameGeneratedByDisplayName": "",
    "m_DefaultReferenceName": "Vector1_416ade29a38846d8a10c9c1e061e3b7c",
    "m_OverrideReferenceName": "",
    "m_GeneratePropertyBlock": true,
    "m_Precision": 0,
    "overrideHLSLDeclaration": false,
    "hlslDeclarationOverride": 0,
    "m_Hidden": false,
    "m_Value": 0.0,
    "m_FloatType": 0,
    "m_RangeValues": {
        "x": 0.0,
        "y": 1.0
    }
}

{
    "m_SGVersion": 0,
    "m_Type": "UnityEditor.ShaderGraph.PropertyNode",
    "m_ObjectId": "4322b951c9db4a62a9d7ed121ed4f118",
    "m_Group": {
        "m_Id": ""
    },
    "m_Name": "Property",
    "m_DrawState": {
        "m_Expanded": true,
        "m_Position": {
            "serializedVersion": "2",
            "x": -276.7499084472656,
            "y": 125.50001525878906,
            "width": 0.0,
            "height": 0.0
        }
    },
    "m_Slots": [
        {
            "m_Id": "afe2928b0367483dacedf0c91744e81f"
        }
    ],
    "synonyms": [],
    "m_Precision": 0,
    "m_PreviewExpanded": true,
    "m_PreviewMode": 0,
    "m_CustomColors": {
        "m_SerializableColors": []
    },
    "m_Property": {
        "m_Id": "04af916c38e7472fb640853268d0b2c8"
    }
}

{
    "m_SGVersion": 0,
    "m_Type": "UnityEditor.ShaderGraph.Vector1MaterialSlot",
    "m_ObjectId": "48c617aebc5642e3a172b282b52f0f30",
    "m_Id": 0,
    "m_DisplayName": "Metallic",
    "m_SlotType": 1,
    "m_Hidden": false,
    "m_ShaderOutputName": "Out",
    "m_StageCapability": 3,
    "m_Value": 0.0,
    "m_DefaultValue": 0.0,
    "m_Labels": []
}

{
    "m_SGVersion": 0,
    "m_Type": "UnityEditor.ShaderGraph.Vector1MaterialSlot",
    "m_ObjectId": "4b7961a924c84c7abde2eefd60f07eee",
    "m_Id": 213700010,
    "m_DisplayName": "Smoothness Remap Max",
    "m_SlotType": 0,
    "m_Hidden": false,
    "m_ShaderOutputName": "Vector1_2066a3e711b7401fb2aa9997bedfeeab",
    "m_StageCapability": 2,
    "m_Value": 0.0,
    "m_DefaultValue": 0.0,
    "m_Labels": []
}

{
    "m_SGVersion": 0,
    "m_Type": "UnityEditor.ShaderGraph.PropertyNode",
    "m_ObjectId": "5184eab4605a4178b1e242794655da3d",
    "m_Group": {
        "m_Id": ""
    },
    "m_Name": "Property",
    "m_DrawState": {
        "m_Expanded": true,
        "m_Position": {
            "serializedVersion": "2",
            "x": -277.0,
            "y": 0.00000476837158203125,
            "width": 117.0,
            "height": 34.0
        }
    },
    "m_Slots": [
        {
            "m_Id": "48c617aebc5642e3a172b282b52f0f30"
        }
    ],
    "synonyms": [],
    "m_Precision": 0,
    "m_PreviewExpanded": true,
    "m_PreviewMode": 0,
    "m_CustomColors": {
        "m_SerializableColors": []
    },
    "m_Property": {
        "m_Id": "009d52f731424eb78b450c2173715b64"
    }
}

{
    "m_SGVersion": 0,
    "m_Type": "UnityEditor.ShaderGraph.Vector4MaterialSlot",
    "m_ObjectId": "55df0ec9f2384942b7c80b521a09808d",
    "m_Id": -211304638,
    "m_DisplayName": "Base Color",
    "m_SlotType": 0,
    "m_Hidden": false,
    "m_ShaderOutputName": "Color_B784F008",
    "m_StageCapability": 2,
    "m_Value": {
        "x": 1.0,
        "y": 1.0,
        "z": 1.0,
        "w": 0.0
    },
    "m_DefaultValue": {
        "x": 0.0,
        "y": 0.0,
        "z": 0.0,
        "w": 0.0
    },
    "m_Labels": []
}

{
    "m_SGVersion": 0,
    "m_Type": "UnityEditor.ShaderGraph.PropertyNode",
    "m_ObjectId": "58e7c2c06118472bbe2e714f9c780100",
    "m_Group": {
        "m_Id": ""
    },
    "m_Name": "Property",
    "m_DrawState": {
        "m_Expanded": true,
        "m_Position": {
            "serializedVersion": "2",
            "x": -276.7499084472656,
            "y": 155.50001525878907,
            "width": 0.0,
            "height": 0.0
        }
    },
    "m_Slots": [
        {
            "m_Id": "8cfe25396e324d11a674c72044cf55d0"
        }
    ],
    "synonyms": [],
    "m_Precision": 0,
    "m_PreviewExpanded": true,
    "m_PreviewMode": 0,
    "m_CustomColors": {
        "m_SerializableColors": []
    },
    "m_Property": {
        "m_Id": "2b31e4f0cd7d4212b78c7be2ac51158e"
    }
}

{
    "m_SGVersion": 0,
    "m_Type": "UnityEditor.ShaderGraph.Texture2DInputMaterialSlot",
    "m_ObjectId": "5c3da8957fc747db88cdfcda8aec353e",
    "m_Id": 1076824718,
    "m_DisplayName": "Base Map",
    "m_SlotType": 0,
    "m_Hidden": false,
    "m_ShaderOutputName": "Texture2D_B0B797D6",
    "m_StageCapability": 2,
    "m_BareResource": false,
    "m_Texture": {
        "m_SerializedTexture": "{\"texture\":{\"instanceID\":0}}",
        "m_Guid": ""
    },
    "m_DefaultType": 0
}

{
    "m_SGVersion": 0,
    "m_Type": "UnityEditor.ShaderGraph.Vector3MaterialSlot",
    "m_ObjectId": "60d4f350240243649b784fdbe53be455",
    "m_Id": 1,
    "m_DisplayName": "Normal",
    "m_SlotType": 1,
    "m_Hidden": false,
    "m_ShaderOutputName": "Normal",
    "m_StageCapability": 2,
    "m_Value": {
        "x": 0.0,
        "y": 0.0,
        "z": 0.0
    },
    "m_DefaultValue": {
        "x": 0.0,
        "y": 0.0,
        "z": 0.0
    },
    "m_Labels": [
        "X",
        "Y",
        "Z"
    ]
}

{
    "m_SGVersion": 0,
    "m_Type": "UnityEditor.ShaderGraph.Vector1MaterialSlot",
    "m_ObjectId": "64ec1119be9d47b99df763964343d377",
    "m_Id": 1,
    "m_DisplayName": "Metallic",
    "m_SlotType": 1,
    "m_Hidden": false,
    "m_ShaderOutputName": "Metallic",
    "m_StageCapability": 2,
    "m_Value": 0.0,
    "m_DefaultValue": 0.0,
    "m_Labels": [
        "X"
    ]
}

{
    "m_SGVersion": 0,
    "m_Type": "UnityEditor.ShaderGraph.Vector4MaterialSlot",
    "m_ObjectId": "6677e69d90a643759e0f9d4cf5f6bd14",
    "m_Id": 0,
    "m_DisplayName": "Base Color",
    "m_SlotType": 1,
    "m_Hidden": false,
    "m_ShaderOutputName": "Out",
    "m_StageCapability": 3,
    "m_Value": {
        "x": 0.0,
        "y": 0.0,
        "z": 0.0,
        "w": 0.0
    },
    "m_DefaultValue": {
        "x": 0.0,
        "y": 0.0,
        "z": 0.0,
        "w": 0.0
    },
    "m_Labels": []
}

{
    "m_SGVersion": 0,
    "m_Type": "UnityEditor.ShaderGraph.Vector1MaterialSlot",
    "m_ObjectId": "6cce0d900abf4babb316dd5fba0a7d9e",
    "m_Id": -575159138,
    "m_DisplayName": "AO Remap Min",
    "m_SlotType": 0,
    "m_Hidden": false,
    "m_ShaderOutputName": "Vector1_5057a537a0894dec8fe6da9c857f3112",
    "m_StageCapability": 2,
    "m_Value": 0.0,
    "m_DefaultValue": 0.0,
    "m_Labels": []
}

{
    "m_SGVersion": 0,
    "m_Type": "UnityEditor.ShaderGraph.PropertyNode",
    "m_ObjectId": "6dc9efa869b44b43a9ed5905365d0d36",
    "m_Group": {
        "m_Id": ""
    },
    "m_Name": "Property",
    "m_DrawState": {
        "m_Expanded": true,
        "m_Position": {
            "serializedVersion": "2",
            "x": -309.0000915527344,
            "y": 348.99993896484377,
            "width": 149.0,
            "height": 34.0
        }
    },
    "m_Slots": [
        {
            "m_Id": "8bb6aa149f6d4d1f9371d8f9307d3db7"
        }
    ],
    "synonyms": [],
    "m_Precision": 0,
    "m_PreviewExpanded": true,
    "m_PreviewMode": 0,
    "m_CustomColors": {
        "m_SerializableColors": []
    },
    "m_Property": {
        "m_Id": "b64538fa235b438ebc19d8872c631822"
    }
}

{
    "m_SGVersion": 0,
    "m_Type": "UnityEditor.ShaderGraph.Vector1MaterialSlot",
    "m_ObjectId": "6deba1f8ca314729bf6c030128d90a30",
    "m_Id": 2,
    "m_DisplayName": "AmbientOcclusion",
    "m_SlotType": 0,
    "m_Hidden": false,
    "m_ShaderOutputName": "AmbientOcclusion",
    "m_StageCapability": 2,
    "m_Value": 0.0,
    "m_DefaultValue": 0.0,
    "m_Labels": []
}

{
    "m_SGVersion": 0,
    "m_Type": "UnityEditor.ShaderGraph.Vector1MaterialSlot",
    "m_ObjectId": "719e177491214ff4bd643df968fecf32",
    "m_Id": 0,
    "m_DisplayName": "Smoothness Remap Max",
    "m_SlotType": 1,
    "m_Hidden": false,
    "m_ShaderOutputName": "Out",
    "m_StageCapability": 3,
    "m_Value": 0.0,
    "m_DefaultValue": 0.0,
    "m_Labels": []
}

{
    "m_SGVersion": 1,
    "m_Type": "UnityEditor.ShaderGraph.Internal.Vector1ShaderProperty",
    "m_ObjectId": "74cf7903c2eb48338dc2113ca2e145c9",
    "m_Guid": {
        "m_GuidSerialized": "ddca3c11-4a4e-48dd-b4ba-b7dceadb81ae"
    },
    "m_Name": "Smoothness Remap Max",
    "m_DefaultRefNameVersion": 0,
    "m_RefNameGeneratedByDisplayName": "",
    "m_DefaultReferenceName": "Vector1_74cf7903c2eb48338dc2113ca2e145c9",
    "m_OverrideReferenceName": "",
    "m_GeneratePropertyBlock": true,
    "m_Precision": 0,
    "overrideHLSLDeclaration": false,
    "hlslDeclarationOverride": 0,
    "m_Hidden": false,
    "m_Value": 0.0,
    "m_FloatType": 0,
    "m_RangeValues": {
        "x": 0.0,
        "y": 1.0
    }
}

{
    "m_SGVersion": 0,
    "m_Type": "UnityEditor.ShaderGraph.Vector2MaterialSlot",
    "m_ObjectId": "79c2a18b014a4c63a8ad7c314236952d",
    "m_Id": 1635626871,
    "m_DisplayName": "UV",
    "m_SlotType": 0,
    "m_Hidden": false,
    "m_ShaderOutputName": "Vector2_8563A324",
    "m_StageCapability": 2,
    "m_Value": {
        "x": 0.0,
        "y": 0.0
    },
    "m_DefaultValue": {
        "x": 0.0,
        "y": 0.0
    },
    "m_Labels": [
        "X",
        "Y"
    ]
}

{
    "m_SGVersion": 0,
    "m_Type": "UnityEditor.ShaderGraph.Vector1MaterialSlot",
    "m_ObjectId": "7b4b51332b74465c8f3779f7501ec071",
    "m_Id": 4,
    "m_DisplayName": "Smoothnes",
    "m_SlotType": 0,
    "m_Hidden": false,
    "m_ShaderOutputName": "Smoothnes",
    "m_StageCapability": 2,
    "m_Value": 0.0,
    "m_DefaultValue": 0.0,
    "m_Labels": []
}

{
    "m_SGVersion": 0,
    "m_Type": "UnityEditor.ShaderGraph.Vector1MaterialSlot",
    "m_ObjectId": "7b89ed6d3fa54c81b0c83815bb2b467e",
    "m_Id": 0,
    "m_DisplayName": "Normal Scale",
    "m_SlotType": 1,
    "m_Hidden": false,
    "m_ShaderOutputName": "Out",
    "m_StageCapability": 3,
    "m_Value": 0.0,
    "m_DefaultValue": 0.0,
    "m_Labels": []
}

{
    "m_SGVersion": 0,
    "m_Type": "UnityEditor.ShaderGraph.Vector2MaterialSlot",
    "m_ObjectId": "8124db1bb63a4ef69185708cdc5314a7",
    "m_Id": -1224440130,
    "m_DisplayName": "UV",
    "m_SlotType": 0,
    "m_Hidden": false,
    "m_ShaderOutputName": "Vector2_61387989",
    "m_StageCapability": 2,
    "m_Value": {
        "x": 0.0,
        "y": 0.0
    },
    "m_DefaultValue": {
        "x": 0.0,
        "y": 0.0
    },
    "m_Labels": []
}

{
    "m_SGVersion": 0,
    "m_Type": "UnityEditor.ShaderGraph.PropertyNode",
    "m_ObjectId": "8838defad18f44b08b90dd61bf46bea0",
    "m_Group": {
        "m_Id": ""
    },
    "m_Name": "Property",
    "m_DrawState": {
        "m_Expanded": true,
        "m_Position": {
            "serializedVersion": "2",
            "x": -309.0000915527344,
            "y": 379.0,
            "width": 145.0,
            "height": 34.0
        }
    },
    "m_Slots": [
        {
            "m_Id": "7b89ed6d3fa54c81b0c83815bb2b467e"
        }
    ],
    "synonyms": [],
    "m_Precision": 0,
    "m_PreviewExpanded": true,
    "m_PreviewMode": 0,
    "m_CustomColors": {
        "m_SerializableColors": []
    },
    "m_Property": {
        "m_Id": "ba9fea1b32ff4f1a901101c48408d9e7"
    }
}

{
    "m_SGVersion": 0,
    "m_Type": "UnityEditor.ShaderGraph.Vector3MaterialSlot",
    "m_ObjectId": "88cfcb99b554447a886b8ae65ff43007",
    "m_Id": 1,
    "m_DisplayName": "Normal",
    "m_SlotType": 1,
    "m_Hidden": false,
    "m_ShaderOutputName": "Normal",
    "m_StageCapability": 2,
    "m_Value": {
        "x": 0.0,
        "y": 0.0,
        "z": 0.0
    },
    "m_DefaultValue": {
        "x": 0.0,
        "y": 0.0,
        "z": 0.0
    },
    "m_Labels": [
        "X",
        "Y",
        "Z"
    ]
}

{
    "m_SGVersion": 0,
    "m_Type": "UnityEditor.ShaderGraph.Texture2DMaterialSlot",
    "m_ObjectId": "8bb6aa149f6d4d1f9371d8f9307d3db7",
    "m_Id": 0,
    "m_DisplayName": "Normal Map",
    "m_SlotType": 1,
    "m_Hidden": false,
    "m_ShaderOutputName": "Out",
    "m_StageCapability": 3,
    "m_BareResource": false
}

{
    "m_SGVersion": 0,
    "m_Type": "UnityEditor.ShaderGraph.Vector1MaterialSlot",
    "m_ObjectId": "8cfe25396e324d11a674c72044cf55d0",
    "m_Id": 0,
    "m_DisplayName": "Smoothness Remap Min",
    "m_SlotType": 1,
    "m_Hidden": false,
    "m_ShaderOutputName": "Out",
    "m_StageCapability": 3,
    "m_Value": 0.0,
    "m_DefaultValue": 0.0,
    "m_Labels": []
}

{
    "m_SGVersion": 0,
    "m_Type": "UnityEditor.ShaderGraph.Internal.Texture2DShaderProperty",
    "m_ObjectId": "8ecf2c57dea847fb8e954b231d4ff442",
    "m_Guid": {
        "m_GuidSerialized": "85af00d6-5eb6-411a-a25f-2fbac1fe98e9"
    },
    "m_Name": "Base Color Map",
    "m_DefaultRefNameVersion": 0,
    "m_RefNameGeneratedByDisplayName": "",
    "m_DefaultReferenceName": "Texture2D_8ecf2c57dea847fb8e954b231d4ff442",
    "m_OverrideReferenceName": "",
    "m_GeneratePropertyBlock": true,
    "m_Precision": 0,
    "overrideHLSLDeclaration": false,
    "hlslDeclarationOverride": 0,
    "m_Hidden": false,
    "m_Value": {
        "m_SerializedTexture": "{\"texture\":{\"instanceID\":0}}",
        "m_Guid": ""
    },
    "m_Modifiable": true,
    "m_DefaultType": 0
}

{
    "m_SGVersion": 0,
    "m_Type": "UnityEditor.ShaderGraph.Vector1MaterialSlot",
    "m_ObjectId": "917ad734c1244c65a72960e15992a0e8",
    "m_Id": -1085397827,
    "m_DisplayName": "Smoothness Remap Min",
    "m_SlotType": 0,
    "m_Hidden": false,
    "m_ShaderOutputName": "Vector1_0707a2f2681e451391de7f9d7897cea0",
    "m_StageCapability": 2,
    "m_Value": 0.0,
    "m_DefaultValue": 0.0,
    "m_Labels": []
}

{
    "m_SGVersion": 0,
    "m_Type": "UnityEditor.ShaderGraph.Vector1MaterialSlot",
    "m_ObjectId": "93e8779abc4c4cd59aa740f7cc06cfe5",
    "m_Id": 0,
    "m_DisplayName": "AO Remap Max",
    "m_SlotType": 1,
    "m_Hidden": false,
    "m_ShaderOutputName": "Out",
    "m_StageCapability": 3,
    "m_Value": 0.0,
    "m_DefaultValue": 0.0,
    "m_Labels": []
}

{
    "m_SGVersion": 0,
    "m_Type": "UnityEditor.ShaderGraph.SubGraphNode",
    "m_ObjectId": "9b55e83d5bc94764badea4a8e05db034",
    "m_Group": {
        "m_Id": ""
    },
    "m_Name": "SG Base Normal",
    "m_DrawState": {
        "m_Expanded": true,
        "m_Position": {
            "serializedVersion": "2",
            "x": -90.0,
            "y": 439.0,
            "width": 225.0,
            "height": 142.0
        }
    },
    "m_Slots": [
        {
            "m_Id": "00940210b3894ddd973358cf67bc2aaf"
        },
        {
            "m_Id": "fc1c972fc36f40b98c1510b554ad1447"
        },
        {
            "m_Id": "e4fbdd82dc8346c4ae039206bd694985"
        },
        {
            "m_Id": "88cfcb99b554447a886b8ae65ff43007"
        }
    ],
    "synonyms": [],
    "m_Precision": 0,
    "m_PreviewExpanded": false,
    "m_PreviewMode": 0,
    "m_CustomColors": {
        "m_SerializableColors": []
    },
    "m_SerializedSubGraph": "{\n    \"subGraph\": {\n        \"fileID\": -5475051401550479605,\n        \"guid\": \"86f2ce8a34cd57d4988a60cd7adbe228\",\n        \"type\": 3\n    }\n}",
    "m_PropertyGuids": [
        "8a8e1fec-278b-434d-a1c2-f21445c776a9",
        "46b32ba0-99cd-486a-b744-f506ab3ba5ac",
        "9296126e-333f-463d-82c7-6d66f936b4ea"
    ],
    "m_PropertyIds": [
        1594186760,
        712926054,
        -861317959
    ]
}

{
    "m_SGVersion": 0,
    "m_Type": "UnityEditor.ShaderGraph.Vector1MaterialSlot",
    "m_ObjectId": "a141bf552d754dc9a99a09afed296221",
    "m_Id": 2,
    "m_DisplayName": "Alpha",
    "m_SlotType": 1,
    "m_Hidden": false,
    "m_ShaderOutputName": "Alpha",
    "m_StageCapability": 2,
    "m_Value": 0.0,
    "m_DefaultValue": 0.0,
    "m_Labels": []
}

{
    "m_SGVersion": 0,
    "m_Type": "UnityEditor.ShaderGraph.Vector1MaterialSlot",
    "m_ObjectId": "a25ec22063844e1d93272da41ca53920",
    "m_Id": 2,
    "m_DisplayName": "AmbientOcclusion",
    "m_SlotType": 1,
    "m_Hidden": false,
    "m_ShaderOutputName": "AmbientOcclusion",
    "m_StageCapability": 2,
    "m_Value": 0.0,
    "m_DefaultValue": 0.0,
    "m_Labels": [
        "X"
    ]
}

{
    "m_SGVersion": 0,
    "m_Type": "UnityEditor.ShaderGraph.Vector1MaterialSlot",
    "m_ObjectId": "a43640c377324eda975cce089e0f0811",
    "m_Id": 6,
    "m_DisplayName": "Alpha",
    "m_SlotType": 0,
    "m_Hidden": false,
    "m_ShaderOutputName": "Alpha",
    "m_StageCapability": 2,
    "m_Value": 0.0,
    "m_DefaultValue": 0.0,
    "m_Labels": []
}

{
    "m_SGVersion": 0,
    "m_Type": "UnityEditor.ShaderGraph.Vector1MaterialSlot",
    "m_ObjectId": "a454479a718246bca0924467d346c8fc",
    "m_Id": -875770945,
    "m_DisplayName": "AO Remap Max",
    "m_SlotType": 0,
    "m_Hidden": false,
    "m_ShaderOutputName": "Vector1_a2d047fab4a244d48d8925978b488bcf",
    "m_StageCapability": 2,
    "m_Value": 0.0,
    "m_DefaultValue": 0.0,
    "m_Labels": []
}

{
    "m_SGVersion": 0,
    "m_Type": "UnityEditor.ShaderGraph.Texture2DMaterialSlot",
    "m_ObjectId": "ae0822b65dbb491689cc80f717d206a2",
    "m_Id": 0,
    "m_DisplayName": "Base Color Map",
    "m_SlotType": 1,
    "m_Hidden": false,
    "m_ShaderOutputName": "Out",
    "m_StageCapability": 3,
    "m_BareResource": false
}

{
    "m_SGVersion": 0,
    "m_Type": "UnityEditor.ShaderGraph.Vector1MaterialSlot",
    "m_ObjectId": "afe2928b0367483dacedf0c91744e81f",
    "m_Id": 0,
    "m_DisplayName": "Coat Mask",
    "m_SlotType": 1,
    "m_Hidden": false,
    "m_ShaderOutputName": "Out",
    "m_StageCapability": 3,
    "m_Value": 0.0,
    "m_DefaultValue": 0.0,
    "m_Labels": []
}

{
    "m_SGVersion": 0,
    "m_Type": "UnityEditor.ShaderGraph.PropertyNode",
    "m_ObjectId": "affb26afbcdb4da3822848429dfc0e14",
    "m_Group": {
        "m_Id": ""
    },
    "m_Name": "Property",
    "m_DrawState": {
        "m_Expanded": true,
        "m_Position": {
            "serializedVersion": "2",
            "x": -276.7499084472656,
            "y": 95.50001525878906,
            "width": 0.0,
            "height": 0.0
        }
    },
    "m_Slots": [
        {
            "m_Id": "93e8779abc4c4cd59aa740f7cc06cfe5"
        }
    ],
    "synonyms": [],
    "m_Precision": 0,
    "m_PreviewExpanded": true,
    "m_PreviewMode": 0,
    "m_CustomColors": {
        "m_SerializableColors": []
    },
    "m_Property": {
        "m_Id": "1c047991ec30462ead078bcde38624e3"
    }
}

{
    "m_SGVersion": 0,
    "m_Type": "UnityEditor.ShaderGraph.Vector3MaterialSlot",
    "m_ObjectId": "b229a5b33f6d42d289cb1e4e760e9f31",
    "m_Id": 1,
    "m_DisplayName": "BaseColor",
    "m_SlotType": 1,
    "m_Hidden": false,
    "m_ShaderOutputName": "BaseColor",
    "m_StageCapability": 2,
    "m_Value": {
        "x": 0.0,
        "y": 0.0,
        "z": 0.0
    },
    "m_DefaultValue": {
        "x": 0.0,
        "y": 0.0,
        "z": 0.0
    },
    "m_Labels": []
}

{
    "m_SGVersion": 0,
    "m_Type": "UnityEditor.ShaderGraph.Internal.Texture2DShaderProperty",
    "m_ObjectId": "b64538fa235b438ebc19d8872c631822",
    "m_Guid": {
        "m_GuidSerialized": "021a551f-0529-4df4-9a7d-047bfbb9f3bd"
    },
    "m_Name": "Normal Map",
    "m_DefaultRefNameVersion": 0,
    "m_RefNameGeneratedByDisplayName": "",
    "m_DefaultReferenceName": "Texture2D_b64538fa235b438ebc19d8872c631822",
    "m_OverrideReferenceName": "",
    "m_GeneratePropertyBlock": true,
    "m_Precision": 0,
    "overrideHLSLDeclaration": false,
    "hlslDeclarationOverride": 0,
    "m_Hidden": false,
    "m_Value": {
        "m_SerializedTexture": "{\"texture\":{\"instanceID\":0}}",
        "m_Guid": ""
    },
    "m_Modifiable": true,
    "m_DefaultType": 0
}

{
    "m_SGVersion": 0,
    "m_Type": "UnityEditor.ShaderGraph.PropertyNode",
    "m_ObjectId": "b731f66229b94be185c05786d5f6d541",
    "m_Group": {
        "m_Id": ""
    },
    "m_Name": "Property",
    "m_DrawState": {
        "m_Expanded": true,
        "m_Position": {
            "serializedVersion": "2",
            "x": -339.0,
            "y": -458.0,
            "width": 134.0,
            "height": 34.0
        }
    },
    "m_Slots": [
        {
            "m_Id": "6677e69d90a643759e0f9d4cf5f6bd14"
        }
    ],
    "synonyms": [],
    "m_Precision": 0,
    "m_PreviewExpanded": true,
    "m_PreviewMode": 0,
    "m_CustomColors": {
        "m_SerializableColors": []
    },
    "m_Property": {
        "m_Id": "0ca032b223584ea4a3f341cffa4915e6"
    }
}

{
    "m_SGVersion": 0,
    "m_Type": "UnityEditor.ShaderGraph.Vector2MaterialSlot",
    "m_ObjectId": "b9841bf8531b4d42bc0764e78942aa8d",
    "m_Id": -861317959,
    "m_DisplayName": "UV",
    "m_SlotType": 0,
    "m_Hidden": false,
    "m_ShaderOutputName": "Vector2_D31991F7",
    "m_StageCapability": 2,
    "m_Value": {
        "x": 0.0,
        "y": 0.0
    },
    "m_DefaultValue": {
        "x": 0.0,
        "y": 0.0
    },
    "m_Labels": [
        "X",
        "Y"
    ]
}

{
    "m_SGVersion": 1,
    "m_Type": "UnityEditor.ShaderGraph.Internal.Vector1ShaderProperty",
    "m_ObjectId": "ba9fea1b32ff4f1a901101c48408d9e7",
    "m_Guid": {
        "m_GuidSerialized": "926936ea-1f69-4556-ad31-835e306e6ffc"
    },
    "m_Name": "Normal Scale",
    "m_DefaultRefNameVersion": 0,
    "m_RefNameGeneratedByDisplayName": "",
    "m_DefaultReferenceName": "Vector1_ba9fea1b32ff4f1a901101c48408d9e7",
    "m_OverrideReferenceName": "",
    "m_GeneratePropertyBlock": true,
    "m_Precision": 0,
    "overrideHLSLDeclaration": false,
    "hlslDeclarationOverride": 0,
    "m_Hidden": false,
    "m_Value": 0.0,
    "m_FloatType": 0,
    "m_RangeValues": {
        "x": 0.0,
        "y": 1.0
    }
}

{
    "m_SGVersion": 0,
    "m_Type": "UnityEditor.ShaderGraph.Vector3MaterialSlot",
    "m_ObjectId": "baf058d1ea144c7cacd5374339f16b52",
    "m_Id": 8,
    "m_DisplayName": "BentNormal",
    "m_SlotType": 0,
    "m_Hidden": false,
    "m_ShaderOutputName": "BentNormal",
    "m_StageCapability": 2,
    "m_Value": {
        "x": 0.0,
        "y": 0.0,
        "z": 0.0
    },
    "m_DefaultValue": {
        "x": 0.0,
        "y": 0.0,
        "z": 0.0
    },
    "m_Labels": []
}

{
    "m_SGVersion": 0,
    "m_Type": "UnityEditor.ShaderGraph.Texture2DMaterialSlot",
    "m_ObjectId": "bd157931e1a14a9cbb92532981bf0dc5",
    "m_Id": 0,
    "m_DisplayName": "Mask Map",
    "m_SlotType": 1,
    "m_Hidden": false,
    "m_ShaderOutputName": "Out",
    "m_StageCapability": 3,
    "m_BareResource": false
}

{
    "m_SGVersion": 0,
    "m_Type": "UnityEditor.ShaderGraph.PropertyNode",
    "m_ObjectId": "be9c571faa6d4c6db3ffabc4ca681ab8",
    "m_Group": {
        "m_Id": ""
    },
    "m_Name": "Property",
    "m_DrawState": {
        "m_Expanded": true,
        "m_Position": {
            "serializedVersion": "2",
            "x": -276.7499084472656,
            "y": 185.50001525878907,
            "width": 0.0,
            "height": 0.0
        }
    },
    "m_Slots": [
        {
            "m_Id": "719e177491214ff4bd643df968fecf32"
        }
    ],
    "synonyms": [],
    "m_Precision": 0,
    "m_PreviewExpanded": true,
    "m_PreviewMode": 0,
    "m_CustomColors": {
        "m_SerializableColors": []
    },
    "m_Property": {
        "m_Id": "74cf7903c2eb48338dc2113ca2e145c9"
    }
}

{
    "m_SGVersion": 0,
    "m_Type": "UnityEditor.ShaderGraph.Vector1MaterialSlot",
    "m_ObjectId": "c43baf48766c496694b9e4fa62fffde0",
    "m_Id": 0,
    "m_DisplayName": "AO Remap Min",
    "m_SlotType": 1,
    "m_Hidden": false,
    "m_ShaderOutputName": "Out",
    "m_StageCapability": 3,
    "m_Value": 0.0,
    "m_DefaultValue": 0.0,
    "m_Labels": []
}

{
    "m_SGVersion": 0,
    "m_Type": "UnityEditor.ShaderGraph.SubGraphNode",
    "m_ObjectId": "da1511a6e0ba4d29aa82297fca79d452",
    "m_Group": {
        "m_Id": ""
    },
    "m_Name": "SG Lit Mask",
    "m_DrawState": {
        "m_Expanded": true,
        "m_Position": {
            "serializedVersion": "2",
            "x": -45.00007629394531,
            "y": -188.0000457763672,
            "width": 325.0,
            "height": 262.0
        }
    },
    "m_Slots": [
        {
            "m_Id": "df281324df9843c2934aecc666691cdc"
        },
        {
            "m_Id": "79c2a18b014a4c63a8ad7c314236952d"
        },
        {
            "m_Id": "06ad01f186e44fb89d594b6865725a95"
        },
        {
            "m_Id": "6cce0d900abf4babb316dd5fba0a7d9e"
        },
        {
            "m_Id": "a454479a718246bca0924467d346c8fc"
        },
        {
            "m_Id": "108d11e6fd7c4d73a676495ce932c204"
        },
        {
            "m_Id": "917ad734c1244c65a72960e15992a0e8"
        },
        {
            "m_Id": "4b7961a924c84c7abde2eefd60f07eee"
        },
        {
            "m_Id": "64ec1119be9d47b99df763964343d377"
        },
        {
            "m_Id": "a25ec22063844e1d93272da41ca53920"
        },
        {
            "m_Id": "385dd29188954b069d2fa77e984c0898"
        },
        {
            "m_Id": "362c50058efb4033aa67062eaccb98c6"
        }
    ],
    "synonyms": [],
    "m_Precision": 0,
    "m_PreviewExpanded": false,
    "m_PreviewMode": 0,
    "m_CustomColors": {
        "m_SerializableColors": []
    },
    "m_SerializedSubGraph": "{\n    \"subGraph\": {\n        \"fileID\": -5475051401550479605,\n        \"guid\": \"8928cb4b7239ec744b5b3e7c43ac14e6\",\n        \"type\": 3\n    }\n}",
    "m_PropertyGuids": [
        "af164107-9834-498d-b60a-443afc79aa9c",
        "727fe891-4002-4791-8079-5347b13bfe77",
        "5f2f69c6-3c59-48f2-b5f0-84371b55dbe5",
        "1c2ac4b1-6dca-4caa-b097-995ee6733d62",
        "8e8e2287-78ab-4eef-a286-a54103c19a56",
        "d434b4a1-3fae-4ca1-8d4d-09dc9507f615",
        "0abe8a4a-c872-41bd-bb8f-090ef8289548",
        "af5084e6-dfe7-4093-8fe4-ad59d817efeb",
        "de9664f4-a1d8-4019-911d-c0667ebf2c50",
        "d5538470-48ef-4947-8268-910e621c529d"
    ],
    "m_PropertyIds": [
        1931610134,
        1635626871,
        -411688495,
        -387938183,
        1394961470,
        -493160427,
        -875770945,
        -575159138,
        -1085397827,
        213700010
    ]
}

{
    "m_SGVersion": 0,
    "m_Type": "UnityEditor.ShaderGraph.Texture2DInputMaterialSlot",
    "m_ObjectId": "df281324df9843c2934aecc666691cdc",
    "m_Id": 1931610134,
    "m_DisplayName": "Mask Map",
    "m_SlotType": 0,
    "m_Hidden": false,
    "m_ShaderOutputName": "Texture2D_87570D3D",
    "m_StageCapability": 2,
    "m_BareResource": false,
    "m_Texture": {
        "m_SerializedTexture": "{\"texture\":{\"instanceID\":0}}",
        "m_Guid": ""
    },
    "m_DefaultType": 0
}

{
    "m_SGVersion": 0,
    "m_Type": "UnityEditor.ShaderGraph.Vector3MaterialSlot",
    "m_ObjectId": "e211a1a847b24ba1ae1f8b8eb52f72d9",
    "m_Id": 7,
    "m_DisplayName": "Normal",
    "m_SlotType": 0,
    "m_Hidden": false,
    "m_ShaderOutputName": "Normal",
    "m_StageCapability": 2,
    "m_Value": {
        "x": 0.0,
        "y": 0.0,
        "z": 0.0
    },
    "m_DefaultValue": {
        "x": 0.0,
        "y": 0.0,
        "z": 0.0
    },
    "m_Labels": []
}

{
    "m_SGVersion": 0,
    "m_Type": "UnityEditor.ShaderGraph.Internal.Texture2DShaderProperty",
    "m_ObjectId": "e32d27c10f744cf9bf01478f30d011cd",
    "m_Guid": {
        "m_GuidSerialized": "4dcebaa6-73ce-43e9-9753-72cc9aafdc2d"
    },
    "m_Name": "Mask Map",
    "m_DefaultRefNameVersion": 0,
    "m_RefNameGeneratedByDisplayName": "",
    "m_DefaultReferenceName": "Texture2D_e32d27c10f744cf9bf01478f30d011cd",
    "m_OverrideReferenceName": "",
    "m_GeneratePropertyBlock": true,
    "m_Precision": 0,
    "overrideHLSLDeclaration": false,
    "hlslDeclarationOverride": 0,
    "m_Hidden": false,
    "m_Value": {
        "m_SerializedTexture": "{\"texture\":{\"instanceID\":0}}",
        "m_Guid": ""
    },
    "m_Modifiable": true,
    "m_DefaultType": 0
}

{
    "m_SGVersion": 0,
    "m_Type": "UnityEditor.ShaderGraph.Vector2MaterialSlot",
    "m_ObjectId": "e4fbdd82dc8346c4ae039206bd694985",
    "m_Id": -861317959,
    "m_DisplayName": "UV",
    "m_SlotType": 0,
    "m_Hidden": false,
    "m_ShaderOutputName": "Vector2_D31991F7",
    "m_StageCapability": 2,
    "m_Value": {
        "x": 0.0,
        "y": 0.0
    },
    "m_DefaultValue": {
        "x": 0.0,
        "y": 0.0
    },
    "m_Labels": [
        "X",
        "Y"
    ]
}

{
    "m_SGVersion": 0,
    "m_Type": "UnityEditor.ShaderGraph.PropertyNode",
    "m_ObjectId": "ed2444fbd3924f0cb980047b738e7afd",
    "m_Group": {
        "m_Id": ""
    },
    "m_Name": "Property",
    "m_DrawState": {
        "m_Expanded": true,
        "m_Position": {
            "serializedVersion": "2",
            "x": -276.7499084472656,
            "y": 65.50001525878906,
            "width": 0.0,
            "height": 0.0
        }
    },
    "m_Slots": [
        {
            "m_Id": "c43baf48766c496694b9e4fa62fffde0"
        }
    ],
    "synonyms": [],
    "m_Precision": 0,
    "m_PreviewExpanded": true,
    "m_PreviewMode": 0,
    "m_CustomColors": {
        "m_SerializableColors": []
    },
    "m_Property": {
        "m_Id": "416ade29a38846d8a10c9c1e061e3b7c"
    }
}

{
    "m_SGVersion": 0,
    "m_Type": "UnityEditor.ShaderGraph.Vector1MaterialSlot",
    "m_ObjectId": "fc1c972fc36f40b98c1510b554ad1447",
    "m_Id": 712926054,
    "m_DisplayName": "Normal Strength",
    "m_SlotType": 0,
    "m_Hidden": false,
    "m_ShaderOutputName": "Vector1_308AAC4B",
    "m_StageCapability": 2,
    "m_Value": 1.0,
    "m_DefaultValue": 0.0,
    "m_Labels": [
        "X"
    ]
}

{
    "m_SGVersion": 0,
    "m_Type": "UnityEditor.ShaderGraph.Internal.Texture2DShaderProperty",
    "m_ObjectId": "fee13a0a9aac44439ebf7d111c0ef30f",
    "m_Guid": {
        "m_GuidSerialized": "6350b109-b846-48da-aad9-42985b21dc8b"
    },
    "m_Name": "Bent Normal Map",
    "m_DefaultRefNameVersion": 1,
    "m_RefNameGeneratedByDisplayName": "Bent Normal Map",
    "m_DefaultReferenceName": "Bent_Normal_Map",
    "m_OverrideReferenceName": "",
    "m_GeneratePropertyBlock": true,
    "m_Precision": 0,
    "overrideHLSLDeclaration": false,
    "hlslDeclarationOverride": 0,
    "m_Hidden": false,
    "m_Value": {
        "m_SerializedTexture": "{\"texture\":{\"instanceID\":0}}",
        "m_Guid": ""
    },
    "m_Modifiable": true,
    "m_DefaultType": 0
}

{
    "m_SGVersion": 1,
    "m_Type": "UnityEditor.ShaderGraph.Internal.Vector2ShaderProperty",
    "m_ObjectId": "fffe2b7808e94161a2e3ee6cb42fd55b",
    "m_Guid": {
        "m_GuidSerialized": "560dee85-b119-4a76-96b0-8420fdb8c4a0"
    },
    "m_Name": "UV",
    "m_DefaultRefNameVersion": 0,
    "m_RefNameGeneratedByDisplayName": "",
    "m_DefaultReferenceName": "Vector2_fffe2b7808e94161a2e3ee6cb42fd55b",
    "m_OverrideReferenceName": "",
    "m_GeneratePropertyBlock": true,
    "m_Precision": 0,
    "overrideHLSLDeclaration": false,
    "hlslDeclarationOverride": 0,
    "m_Hidden": false,
    "m_Value": {
        "x": 0.0,
        "y": 0.0,
        "z": 0.0,
        "w": 0.0
    }
}

