25
skydome 0 180.000000 63.450000 0.000000 pfx_new
 1.000000 1.000000 1.000000  0.000000 0.000000 0.000000  0.250000 0.250000 0.250000  0.000000 0
skydome 0 0.000000 49.650000 0.000000 pfx_new
 0.498039 0.498039 1.000000  0.000000 0.000000 0.000000  0.125490 0.141176 0.172549  0.000000 0
skydome 0 0.000000 45.990000 0.000000 pfx_new
 0.498039 0.498039 1.000000  0.000000 0.000000 0.000000  0.125490 0.141176 0.164706  0.000000 0
skydome 0 0.000000 35.520000 0.000000 pfx_new
 0.498039 0.498039 1.000000  0.000000 0.000000 0.000000  0.125490 0.141176 0.164706  0.000000 0
skydome 0 0.000000 19.140000 0.000000 pfx_new
 0.498039 0.498039 1.000000  0.000000 0.000000 0.000000  0.117647 0.133333 0.149020  0.000000 0
skydome 0 0.000000 0.640000 0.000000 pfx_new
 1.000000 0.540368 0.310552  0.000000 0.000000 0.000000  0.219608 0.239216 0.243137  0.000000 0
skydome 0 0.000000 8.840000 0.000000 pfx_new
 1.000000 0.655356 0.483034  0.000000 0.000000 0.000000  0.400000 0.454902 0.505882  0.000000 0
skydome 0 0.000000 17.830000 0.000000 pfx_new
 1.000000 0.721460 0.582190  0.000000 0.000000 0.000000  0.454902 0.513725 0.588235  0.000000 0
skydome 0 0.000000 27.310000 0.000000 pfx_new
 1.000000 0.774548 0.661822  0.000000 0.000000 0.000000  0.470588 0.537255 0.619608  0.000000 0
skydome 0 0.000000 36.940000 0.000000 pfx_new
 1.000000 0.819625 0.729438  0.000000 0.000000 0.000000  0.486275 0.552941 0.639216  0.000000 0
skydome 0 0.000000 46.290000 0.000000 pfx_new
 1.000000 0.858031 0.787046  0.000000 0.000000 0.000000  0.505882 0.568627 0.650980  0.000000 0
skydome 0 0.000000 54.710000 0.000000 pfx_new
 1.000000 0.889404 0.834106  0.000000 0.000000 0.000000  0.505882 0.572549 0.658824  0.000000 0
skydome 0 0.000000 61.020000 0.000000 pfx_new
 1.000000 0.911358 0.867036  0.000000 0.000000 0.000000  0.513725 0.576471 0.666667  0.000000 0
skydome 0 0.000000 63.450000 0.000000 pfx_new
 1.000000 0.919507 0.879260  0.000000 0.000000 0.000000  0.513725 0.576471 0.666667  0.000000 0
skydome 0 0.000000 61.020000 0.000000 pfx_new
 1.000000 0.911358 0.867036  0.000000 0.000000 0.000000  0.513725 0.576471 0.666667  0.000000 0
skydome 0 0.000000 54.710000 0.000000 pfx_new
 1.000000 0.889404 0.834106  0.000000 0.000000 0.000000  0.505882 0.572549 0.658824  0.000000 0
skydome 0 0.000000 46.290000 0.000000 pfx_new
 1.000000 0.858031 0.787046  0.000000 0.000000 0.000000  0.505882 0.568627 0.650980  0.000000 0
skydome 0 0.000000 36.940000 0.000000 pfx_new
 1.000000 0.819625 0.729438  0.000000 0.000000 0.000000  0.486275 0.552941 0.639216  0.000000 0
skydome 0 0.000000 27.310000 0.000000 pfx_new
 1.000000 0.774548 0.661822  0.000000 0.000000 0.000000  0.470588 0.537255 0.619608  0.000000 0
skydome 0 0.000000 17.830000 0.000000 pfx_new
 1.000000 0.721460 0.582190  0.000000 0.000000 0.000000  0.454902 0.513725 0.588235  0.000000 0
skydome 0 0.000000 8.840000 0.000000 pfx_new
 1.000000 0.655356 0.483034  0.000000 0.000000 0.000000  0.400000 0.454902 0.505882  0.000000 0
skydome 0 0.000000 0.640000 0.000000 pfx_new
 1.000000 0.540368 0.310552  0.000000 0.000000 0.000000  0.219608 0.239216 0.243137  0.000000 0
skydome 0 0.000000 19.140000 0.000000 pfx_new
 0.498039 0.498039 1.000000  0.000000 0.000000 0.000000  0.117647 0.133333 0.149020  0.000000 0
skydome 0 0.000000 35.520000 0.000000 pfx_new
 0.498039 0.498039 1.000000  0.000000 0.000000 0.000000  0.125490 0.141176 0.164706  0.000000 0
skydome 0 0.000000 45.990000 0.000000 pfx_new
 0.498039 0.498039 1.000000  0.000000 0.000000 0.000000  0.125490 0.141176 0.164706  0.000000 0
