particle_systemsfile version 1
71
psys_game_rain 272 prtcl_rain  1000 2.000000 0.100000 3.000000 5.000000 5.000000 
0.500000 1.000000   1.000000 0.000000
1.000000 1.000000   1.000000 1.000000
1.000000 1.000000   1.000000 1.000000
1.000000 1.000000   1.000000 1.000000
1.000000 1.000000   1.000000 1.000000
8.000000 8.000000 1.000000   0.000000 0.000000 0.000000   0.100000 
0.000000 0.000000 
psys_game_snow 12816 prt_mesh_snow_fall_1  1000 3.000000 0.300000 0.500000 5.000000 10.000000 
0.500000 1.000000   1.000000 0.000000
1.000000 1.000000   1.000000 1.000000
1.000000 1.000000   1.000000 1.000000
1.000000 1.000000   1.000000 1.000000
0.000000 0.030000   1.000000 0.030000
8.000000 8.000000 1.000000   0.000000 0.000000 0.000000   1.000000 
200.000000 0.500000 
psys_game_blood 12800 prt_mesh_blood_1  100 1.200000 3.000000 0.500000 0.000000 0.000000 
0.000000 0.500000   1.000000 0.000000
0.100000 0.700000   1.000000 0.700000
0.100000 0.700000   1.000000 0.700000
0.100000 0.700000   1.000000 0.700000
0.000000 0.200000   1.000000 0.400000
0.000000 0.050000 0.000000   0.000000 1.000000 0.300000   0.900000 
0.000000 0.000000 
psys_game_blood_2 12800 prt_mesh_blood_3  100 1.200000 3.000000 0.300000 0.000000 0.000000 
0.000000 0.500000   1.000000 0.000000
0.100000 0.700000   1.000000 0.700000
0.100000 0.700000   1.000000 0.700000
0.100000 0.700000   1.000000 0.700000
0.000000 0.200000   1.000000 0.400000
0.010000 0.200000 0.010000   0.200000 0.300000 0.000000   0.300000 
150.000000 0.000000 
psys_game_hoof_dust 78336 prt_mesh_dust_1  4 5.000000 10.000000 0.020000 10.000000 20.000000 
0.100000 0.200000   1.000000 0.000000
0.000000 0.600000   1.000000 0.800000
0.000000 0.500000   1.000000 0.700000
0.000000 0.300000   1.000000 0.500000
0.000000 2.000000   1.000000 5.000000
0.200000 0.300000 0.200000   0.000000 0.000000 3.000000   0.500000 
130.000000 0.500000 
psys_game_hoof_dust_snow 8704 prt_mesh_snow_dust_1  6 2.000000 3.500000 1.000000 10.000000 0.000000 
0.200000 1.000000   1.000000 1.000000
0.000000 1.000000   1.000000 1.000000
0.000000 1.000000   1.000000 1.000000
0.000000 1.000000   1.000000 1.000000
0.500000 2.000000   1.000000 5.000000
0.200000 1.000000 0.100000   0.000000 0.000000 1.000000   2.000000 
0.000000 0.000000 
psys_game_hoof_dust_mud 78080 prt_mesh_mud_1  5 0.700000 10.000000 3.000000 0.000000 0.000000 
0.000000 1.000000   1.000000 1.000000
0.000000 0.700000   1.000000 0.700000
0.000000 0.600000   1.000000 0.600000
0.000000 0.400000   1.000000 0.400000
0.000000 0.200000   1.000000 0.300000
0.150000 0.500000 0.100000   0.000000 0.000000 15.000000   6.000000 
200.000000 0.500000 
psys_game_water_splash_1 12832 prtcl_drop  20 0.850000 0.250000 0.900000 10.000000 0.000000 
0.300000 0.500000   1.000000 0.000000
1.000000 1.000000   1.000000 1.000000
1.000000 1.000000   1.000000 1.000000
1.000000 1.000000   1.000000 1.000000
0.000000 0.300000   1.000000 0.180000
0.300000 0.200000 0.100000   0.000000 1.200000 2.300000   0.300000 
50.000000 0.500000 
psys_game_water_splash_2 12832 prtcl_splash_b  30 0.400000 0.700000 0.500000 10.000000 0.000000 
0.300000 1.000000   1.000000 0.300000
1.000000 1.000000   1.000000 1.000000
1.000000 1.000000   1.000000 1.000000
1.000000 1.000000   1.000000 1.000000
0.000000 0.250000   1.000000 0.700000
0.400000 0.300000 0.100000   0.000000 1.300000 1.100000   0.100000 
50.000000 0.500000 
psys_game_water_splash_3 32 prt_mesh_water_wave_1  5 2.000000 0.000000 0.000000 10.000000 0.000000 
0.030000 0.200000   1.000000 0.000000
1.000000 1.000000   1.000000 1.000000
1.000000 1.000000   1.000000 1.000000
1.000000 1.000000   1.000000 1.000000
0.000000 3.000000   1.000000 10.000000
0.000000 0.000000 0.000000   0.000000 0.000000 0.000000   0.000000 
0.000000 0.500000 
psys_ladder_dust_6m 512 prt_mesh_smoke_1  700 0.900000 0.000000 0.000000 7.000000 7.000000 
0.000000 0.250000   1.000000 0.000000
0.000000 1.000000   1.000000 0.800000
0.000000 1.000000   1.000000 0.800000
0.000000 1.000000   1.000000 0.800000
0.000000 1.000000   1.000000 2.000000
0.750000 0.750000 3.500000   0.000000 0.000000 0.000000   0.100000 
100.000000 0.200000 
psys_ladder_dust_8m 512 prt_mesh_smoke_1  900 0.900000 0.000000 0.000000 7.000000 7.000000 
0.000000 0.250000   1.000000 0.000000
0.000000 1.000000   1.000000 0.800000
0.000000 1.000000   1.000000 0.800000
0.000000 1.000000   1.000000 0.800000
0.000000 1.000000   1.000000 2.000000
0.750000 0.750000 4.500000   0.000000 0.000000 0.000000   0.100000 
100.000000 0.200000 
psys_ladder_dust_10m 512 prt_mesh_smoke_1  1100 0.900000 0.000000 0.000000 7.000000 7.000000 
0.000000 0.250000   1.000000 0.000000
0.000000 1.000000   1.000000 0.800000
0.000000 1.000000   1.000000 0.800000
0.000000 1.000000   1.000000 0.800000
0.000000 1.000000   1.000000 2.000000
0.750000 0.750000 5.500000   0.000000 0.000000 0.000000   0.100000 
100.000000 0.200000 
psys_ladder_dust_12m 512 prt_mesh_smoke_1  1300 0.900000 0.000000 0.000000 7.000000 7.000000 
0.000000 0.250000   1.000000 0.000000
0.000000 1.000000   1.000000 0.800000
0.000000 1.000000   1.000000 0.800000
0.000000 1.000000   1.000000 0.800000
0.000000 1.000000   1.000000 2.000000
0.750000 0.750000 6.500000   0.000000 0.000000 0.000000   0.100000 
100.000000 0.200000 
psys_ladder_dust_14m 512 prt_mesh_smoke_1  1500 0.900000 0.000000 0.000000 7.000000 7.000000 
0.000000 0.250000   1.000000 0.000000
0.000000 1.000000   1.000000 0.800000
0.000000 1.000000   1.000000 0.800000
0.000000 1.000000   1.000000 0.800000
0.000000 1.000000   1.000000 2.000000
0.750000 0.750000 7.500000   0.000000 0.000000 0.000000   0.100000 
100.000000 0.200000 
psys_ladder_straw_6m 12288 prt_mesh_straw_1  700 1.000000 2.000000 0.900000 10.000000 2.000000 
0.100000 1.000000   1.000000 1.000000
0.100000 0.600000   1.000000 0.600000
0.100000 0.500000   1.000000 0.500000
0.100000 0.400000   1.000000 0.400000
0.000000 0.300000   1.000000 0.300000
0.750000 0.750000 3.500000   0.000000 0.000000 0.000000   2.300000 
200.000000 0.000000 
psys_ladder_straw_8m 12288 prt_mesh_straw_1  900 1.000000 2.000000 0.900000 10.000000 2.000000 
0.100000 1.000000   1.000000 1.000000
0.100000 0.600000   1.000000 0.600000
0.100000 0.500000   1.000000 0.500000
0.100000 0.400000   1.000000 0.400000
0.000000 0.300000   1.000000 0.300000
0.750000 0.750000 4.500000   0.000000 0.000000 0.000000   2.300000 
200.000000 0.000000 
psys_ladder_straw_10m 12288 prt_mesh_straw_1  1100 1.000000 2.000000 0.900000 10.000000 2.000000 
0.100000 1.000000   1.000000 1.000000
0.100000 0.600000   1.000000 0.600000
0.100000 0.500000   1.000000 0.500000
0.100000 0.400000   1.000000 0.400000
0.000000 0.300000   1.000000 0.300000
0.750000 0.750000 5.500000   0.000000 0.000000 0.000000   2.300000 
200.000000 0.000000 
psys_ladder_straw_12m 12288 prt_mesh_straw_1  1300 1.000000 2.000000 0.900000 10.000000 2.000000 
0.100000 1.000000   1.000000 1.000000
0.100000 0.600000   1.000000 0.600000
0.100000 0.500000   1.000000 0.500000
0.100000 0.400000   1.000000 0.400000
0.000000 0.300000   1.000000 0.300000
0.750000 0.750000 6.500000   0.000000 0.000000 0.000000   2.300000 
200.000000 0.000000 
psys_ladder_straw_14m 12288 prt_mesh_straw_1  1500 1.000000 2.000000 0.900000 10.000000 2.000000 
0.100000 1.000000   1.000000 1.000000
0.100000 0.600000   1.000000 0.600000
0.100000 0.500000   1.000000 0.500000
0.100000 0.400000   1.000000 0.400000
0.000000 0.300000   1.000000 0.300000
0.750000 0.750000 7.500000   0.000000 0.000000 0.000000   2.300000 
200.000000 0.000000 
psys_firearm_flashpan_fire 4608 prt_sparks_1  10 0.100000 0.000000 0.000000 0.000000 0.000000 
0.000000 1.000000   1.000000 1.000000
0.000000 1.000000   1.000000 1.000000
0.000000 1.000000   1.000000 1.000000
0.000000 1.000000   1.000000 1.000000
0.000000 0.200000   1.000000 1.000000
0.000000 0.000000 0.000000   -1.500000 0.000000 0.000000   0.000000 
0.000000 0.000000 
psys_musket_muzzle_fire 4608 prt_explosion_1  10 0.100000 0.000000 0.000000 0.000000 0.000000 
0.000000 1.000000   1.000000 1.000000
0.000000 1.000000   1.000000 1.000000
0.000000 1.000000   1.000000 1.000000
0.000000 1.000000   1.000000 1.000000
0.000000 0.200000   1.000000 1.000000
0.000000 0.000000 0.000000   0.000000 3.000000 0.000000   0.000000 
0.000000 0.000000 
psys_pistol_muzzle_fire 4608 prt_explosion_1  10 0.100000 0.000000 0.000000 0.000000 0.000000 
0.000000 1.000000   1.000000 1.000000
0.000000 1.000000   1.000000 1.000000
0.000000 1.000000   1.000000 1.000000
0.000000 1.000000   1.000000 1.000000
0.000000 0.200000   1.000000 1.000000
0.000000 0.000000 0.000000   0.000000 2.500000 0.000000   0.000000 
0.000000 0.000000 
psys_firearm_flashpan_smoke 12800 prtcl_dust_b  50 15.000000 3.000000 0.000000 5.000000 2.000000 
0.050000 0.250000   1.000000 0.000000
0.000000 0.500000   1.000000 0.500000
0.000000 0.500000   1.000000 0.500000
0.000000 0.500000   1.000000 0.500000
0.000000 0.500000   0.200000 1.500000
0.000000 0.000000 0.000000   -2.000000 0.000000 0.000000   0.500000 
100.000000 1.000000 
psys_musket_muzzle_smoke 12800 prtcl_dust_b  50 15.000000 3.000000 0.000000 5.000000 2.000000 
0.050000 0.250000   1.000000 0.000000
0.000000 0.500000   1.000000 0.500000
0.000000 0.500000   1.000000 0.500000
0.000000 0.500000   1.000000 0.500000
0.000000 0.500000   0.200000 1.500000
0.000000 0.000000 0.000000   0.000000 7.000000 0.000000   0.500000 
100.000000 1.000000 
psys_pistol_muzzle_smoke 12800 prtcl_dust_b  50 15.000000 3.000000 0.000000 5.000000 2.000000 
0.050000 0.250000   1.000000 0.000000
0.000000 0.500000   1.000000 0.500000
0.000000 0.500000   1.000000 0.500000
0.000000 0.500000   1.000000 0.500000
0.000000 0.500000   0.200000 1.500000
0.000000 0.000000 0.000000   0.000000 5.000000 0.000000   0.500000 
100.000000 1.000000 
psys_cannon_flashpan_fire 4608 prt_sparks_1  10 0.100000 0.000000 0.000000 0.000000 0.000000 
0.000000 1.000000   1.000000 1.000000
0.000000 1.000000   1.000000 1.000000
0.000000 1.000000   1.000000 1.000000
0.000000 1.000000   1.000000 1.000000
0.000000 0.200000   1.000000 1.000000
0.000000 0.000000 0.000000   0.000000 -1.000000 3.000000   0.000000 
0.000000 0.000000 
psys_cannon_flashpan_smoke 12800 prtcl_dust_b  50 15.000000 3.000000 0.000000 5.000000 2.000000 
0.050000 0.250000   1.000000 0.000000
0.000000 0.500000   1.000000 0.500000
0.000000 0.500000   1.000000 0.500000
0.000000 0.500000   1.000000 0.500000
0.000000 0.500000   0.200000 2.000000
0.000000 0.000000 0.000000   0.000000 -0.800000 2.400000   0.500000 
100.000000 1.000000 
psys_cannon_muzzle_fire 4608 prt_explosion_1  5 0.200000 0.000000 0.000000 0.000000 0.000000 
0.000000 1.000000   1.000000 1.000000
0.000000 1.000000   1.000000 1.000000
0.000000 1.000000   1.000000 1.000000
0.000000 1.000000   1.000000 1.000000
0.000000 0.500000   1.000000 1.500000
0.000000 0.000000 0.000000   0.000000 4.000000 0.000000   0.000000 
0.000000 0.000000 
psys_cannon_muzzle_smoke 12800 prtcl_dust_b  200 15.000000 3.000000 0.000000 50.000000 2.000000 
0.050000 0.250000   1.000000 0.000000
0.000000 0.500000   1.000000 0.500000
0.000000 0.500000   1.000000 0.500000
0.000000 0.500000   1.000000 0.500000
0.000000 1.000000   0.200000 3.000000
0.200000 0.200000 0.200000   0.000000 20.000000 0.000000   3.000000 
100.000000 1.000000 
psys_bullet_hit_particle 4624 prt_mud_1  10 2.000000 0.300000 0.700000 0.000000 0.000000 
0.000000 1.000000   1.000000 0.000000
0.000000 0.239216   1.000000 0.239216
0.000000 0.164706   1.000000 0.164706
0.000000 0.101961   1.000000 0.101961
0.000000 1.000000   1.000000 2.000000
0.000000 0.000000 0.000000   0.000000 0.000000 2.000000   0.000000 
50.000000 0.200000 
psys_bullet_hit 12816 prtcl_dust_b  30 5.000000 2.000000 0.010000 0.500000 2.000000 
0.000000 0.500000   1.000000 0.000000
0.000000 0.427451   1.000000 0.427451
0.000000 0.290196   1.000000 0.290196
0.000000 0.160784   1.000000 0.160784
0.000000 0.300000   0.500000 1.000000
0.000000 0.000000 0.000000   0.000000 0.000000 1.000000   0.100000 
100.000000 1.000000 
psys_bullet_hit_objects 12800 prtcl_dust_b  30 5.000000 2.000000 0.010000 0.500000 2.000000 
0.000000 0.500000   1.000000 0.000000
0.000000 0.725490   1.000000 0.725490
0.000000 0.607843   1.000000 0.607843
0.000000 0.458824   1.000000 0.458824
0.000000 0.300000   0.500000 1.000000
0.000000 0.000000 0.000000   0.000000 -1.000000 0.000000   0.100000 
100.000000 1.000000 
psys_water_hit_a 12816 prtcl_splash_b  40 1.000000 0.500000 0.200000 0.000000 0.000000 
0.000000 1.000000   1.000000 0.000000
0.000000 1.000000   1.000000 1.000000
0.000000 1.000000   1.000000 1.000000
0.000000 1.000000   1.000000 1.000000
0.000000 0.200000   1.000000 1.000000
0.000000 0.000000 0.000000   0.000000 0.000000 1.500000   0.000000 
50.000000 0.200000 
psys_water_hit_b 13328 prtcl_splash_b  10 10.000000 0.000000 0.000000 0.000000 0.000000 
0.000000 1.000000   1.000000 0.000000
0.000000 1.000000   1.000000 1.000000
0.000000 1.000000   1.000000 1.000000
0.000000 1.000000   1.000000 1.000000
0.000000 0.500000   1.000000 10.000000
0.100000 0.100000 0.000000   0.000000 0.000000 -0.010000   0.000000 
25.000000 0.100000 
psys_hit_explosion_big 4608 prt_explosion_1  5 0.200000 0.000000 0.000000 0.000000 0.000000 
0.000000 1.000000   1.000000 0.000000
0.000000 1.000000   1.000000 1.000000
0.000000 1.000000   1.000000 1.000000
0.000000 1.000000   1.000000 1.000000
0.000000 2.000000   1.000000 4.000000
0.000000 0.000000 0.000000   0.000000 0.000000 2.000000   0.000000 
0.000000 0.000000 
psys_hit_sparks_big 4608 prt_sparks_1  10 0.200000 0.000000 0.000000 0.000000 0.000000 
0.000000 1.000000   1.000000 0.000000
0.000000 1.000000   1.000000 1.000000
0.000000 1.000000   1.000000 1.000000
0.000000 1.000000   1.000000 1.000000
0.000000 2.000000   1.000000 4.000000
0.000000 0.000000 0.000000   0.000000 0.000000 10.000000   0.000000 
0.000000 0.000000 
psys_hit_ground_big 12800 prt_mud_1  1000 3.000000 0.300000 0.700000 0.000000 0.000000 
0.000000 1.000000   1.000000 0.000000
0.000000 0.239216   1.000000 0.239216
0.000000 0.164706   1.000000 0.164706
0.000000 0.101961   1.000000 0.101961
0.000000 1.000000   1.000000 2.000000
0.500000 0.500000 0.500000   0.000000 0.000000 4.000000   1.000000 
50.000000 0.200000 
psys_hit_object_dust_big 12800 prtcl_dust_b  20 10.000000 2.000000 0.010000 0.500000 2.000000 
0.000000 0.500000   1.000000 0.000000
0.000000 0.725490   1.000000 0.725490
0.000000 0.607843   1.000000 0.607843
0.000000 0.458824   1.000000 0.458824
0.000000 2.000000   1.000000 5.000000
1.000000 1.000000 1.000000   0.000000 0.000000 1.000000   0.250000 
100.000000 1.000000 
psys_hit_ground_dust_big 12800 prtcl_dust_b  20 10.000000 2.000000 0.010000 0.500000 2.000000 
0.000000 0.500000   1.000000 0.000000
0.000000 0.427451   1.000000 0.427451
0.000000 0.290196   1.000000 0.290196
0.000000 0.160784   1.000000 0.160784
0.000000 2.000000   1.000000 5.000000
1.000000 1.000000 1.000000   0.000000 0.000000 1.000000   0.250000 
100.000000 1.000000 
psys_missile_dust_ground_sml 4610 prtcl_dust_b  30 0.500000 0.000000 0.000000 0.500000 2.000000 
0.000000 0.500000   1.000000 0.000000
0.000000 0.427451   1.000000 0.427451
0.000000 0.290196   1.000000 0.290196
0.000000 0.160784   1.000000 0.160784
0.000000 0.300000   1.000000 0.600000
0.100000 0.000000 0.100000   0.000000 0.000000 0.000000   0.000000 
100.000000 1.000000 
psys_missile_dust_ground_med 4610 prtcl_dust_b  30 0.500000 0.000000 0.000000 0.500000 2.000000 
0.000000 0.500000   1.000000 0.000000
0.000000 0.427451   1.000000 0.427451
0.000000 0.290196   1.000000 0.290196
0.000000 0.160784   1.000000 0.160784
0.000000 0.600000   1.000000 1.200000
0.200000 0.000000 0.200000   0.000000 0.000000 0.000000   0.000000 
100.000000 1.000000 
psys_missile_dust_ground_big 4610 prtcl_dust_b  30 0.500000 0.000000 0.000000 0.500000 2.000000 
0.000000 0.500000   1.000000 0.000000
0.000000 0.427451   1.000000 0.427451
0.000000 0.290196   1.000000 0.290196
0.000000 0.160784   1.000000 0.160784
0.000000 0.900000   1.000000 1.800000
0.300000 0.000000 0.300000   0.000000 0.000000 0.000000   0.000000 
100.000000 1.000000 
psys_missile_dust_object_sml 4610 prtcl_dust_b  30 0.500000 0.000000 0.000000 0.500000 2.000000 
0.000000 0.500000   1.000000 0.000000
0.000000 0.725490   1.000000 0.725490
0.000000 0.607843   1.000000 0.607843
0.000000 0.458824   1.000000 0.458824
0.000000 0.300000   1.000000 0.600000
0.100000 0.000000 0.100000   0.000000 0.000000 0.000000   0.000000 
100.000000 1.000000 
psys_missile_dust_object_med 4610 prtcl_dust_b  30 0.500000 0.000000 0.000000 0.500000 2.000000 
0.000000 0.500000   1.000000 0.000000
0.000000 0.725490   1.000000 0.725490
0.000000 0.607843   1.000000 0.607843
0.000000 0.458824   1.000000 0.458824
0.000000 0.600000   1.000000 1.200000
0.200000 0.000000 0.200000   0.000000 0.000000 0.000000   0.000000 
100.000000 1.000000 
psys_missile_dust_object_big 4610 prtcl_dust_b  30 0.500000 0.000000 0.000000 0.500000 2.000000 
0.000000 0.500000   1.000000 0.000000
0.000000 0.725490   1.000000 0.725490
0.000000 0.607843   1.000000 0.607843
0.000000 0.458824   1.000000 0.458824
0.000000 0.900000   1.000000 1.800000
0.300000 0.000000 0.300000   0.000000 0.000000 0.000000   0.000000 
100.000000 1.000000 
psys_launch_dust_ground_sml 4608 prtcl_dust_b  20 15.000000 2.000000 0.010000 0.500000 2.000000 
0.000000 0.500000   1.000000 0.000000
0.000000 0.427451   1.000000 0.427451
0.000000 0.290196   1.000000 0.290196
0.000000 0.160784   1.000000 0.160784
0.000000 0.500000   1.000000 0.500000
0.200000 0.000000 0.200000   0.000000 8.000000 0.000000   0.100000 
100.000000 1.000000 
psys_launch_dust_ground_med 4608 prtcl_dust_b  20 15.000000 2.000000 0.010000 0.500000 2.000000 
0.000000 0.500000   1.000000 0.000000
0.000000 0.427451   1.000000 0.427451
0.000000 0.290196   1.000000 0.290196
0.000000 0.160784   1.000000 0.160784
0.000000 1.000000   1.000000 1.000000
0.300000 0.000000 0.300000   0.000000 6.000000 0.000000   0.100000 
100.000000 1.000000 
psys_launch_dust_ground_big 4608 prtcl_dust_b  20 15.000000 2.000000 0.010000 0.500000 2.000000 
0.000000 0.500000   1.000000 0.000000
0.000000 0.427451   1.000000 0.427451
0.000000 0.290196   1.000000 0.290196
0.000000 0.160784   1.000000 0.160784
0.000000 1.500000   1.000000 1.500000
0.400000 0.000000 0.400000   0.000000 4.000000 0.000000   0.100000 
100.000000 1.000000 
psys_launch_dust_object_sml 4608 prtcl_dust_b  20 15.000000 2.000000 0.010000 0.500000 2.000000 
0.000000 0.500000   1.000000 0.000000
0.000000 0.725490   1.000000 0.725490
0.000000 0.607843   1.000000 0.607843
0.000000 0.458824   1.000000 0.458824
0.000000 0.500000   1.000000 0.500000
0.200000 0.000000 0.200000   0.000000 8.000000 0.000000   0.100000 
100.000000 1.000000 
psys_launch_dust_object_med 4608 prtcl_dust_b  20 15.000000 2.000000 0.010000 0.500000 2.000000 
0.000000 0.500000   1.000000 0.000000
0.000000 0.725490   1.000000 0.725490
0.000000 0.607843   1.000000 0.607843
0.000000 0.458824   1.000000 0.458824
0.000000 1.000000   1.000000 1.000000
0.300000 0.000000 0.300000   0.000000 6.000000 0.000000   0.100000 
100.000000 1.000000 
psys_launch_dust_object_big 4608 prtcl_dust_b  20 15.000000 2.000000 0.010000 0.500000 2.000000 
0.000000 0.500000   1.000000 0.000000
0.000000 0.725490   1.000000 0.725490
0.000000 0.607843   1.000000 0.607843
0.000000 0.458824   1.000000 0.458824
0.000000 1.500000   1.000000 1.500000
0.400000 0.000000 0.400000   0.000000 4.000000 0.000000   0.100000 
100.000000 1.000000 
psys_lightning_1 256 lightning_1  4 0.250000 0.000000 0.000000 0.000000 0.000000 
0.500000 1.000000   1.000000 0.000000
0.000000 1.000000   1.000000 1.000000
0.000000 1.000000   1.000000 1.000000
0.000000 1.000000   1.000000 1.000000
0.000000 500.000000   1.000000 500.000000
0.000000 0.000000 0.000000   0.000000 0.000000 0.000000   0.000000 
0.000000 0.000000 
psys_lightning_2 256 lightning_2  4 0.250000 0.000000 0.000000 0.000000 0.000000 
0.500000 1.000000   1.000000 0.000000
0.000000 1.000000   1.000000 1.000000
0.000000 1.000000   1.000000 1.000000
0.000000 1.000000   1.000000 1.000000
0.000000 500.000000   1.000000 500.000000
0.000000 0.000000 0.000000   0.000000 0.000000 0.000000   0.000000 
0.000000 0.000000 
psys_lightning_3 256 lightning_3  4 0.250000 0.000000 0.000000 0.000000 0.000000 
0.500000 1.000000   1.000000 0.000000
0.000000 1.000000   1.000000 1.000000
0.000000 1.000000   1.000000 1.000000
0.000000 1.000000   1.000000 1.000000
0.000000 500.000000   1.000000 500.000000
0.000000 0.000000 0.000000   0.000000 0.000000 0.000000   0.000000 
0.000000 0.000000 
psys_lightning_4 256 lightning_4  4 0.250000 0.000000 0.000000 0.000000 0.000000 
0.500000 1.000000   1.000000 0.000000
0.000000 1.000000   1.000000 1.000000
0.000000 1.000000   1.000000 1.000000
0.000000 1.000000   1.000000 1.000000
0.000000 500.000000   1.000000 500.000000
0.000000 0.000000 0.000000   0.000000 0.000000 0.000000   0.000000 
0.000000 0.000000 
psys_lightning_5 256 lightning_5  4 0.250000 0.000000 0.000000 0.000000 0.000000 
0.500000 1.000000   1.000000 0.000000
0.000000 1.000000   1.000000 1.000000
0.000000 1.000000   1.000000 1.000000
0.000000 1.000000   1.000000 1.000000
0.000000 500.000000   1.000000 500.000000
0.000000 0.000000 0.000000   0.000000 0.000000 0.000000   0.000000 
0.000000 0.000000 
psys_lightning_6 256 lightning_6  4 0.250000 0.000000 0.000000 0.000000 0.000000 
0.500000 1.000000   1.000000 0.000000
0.000000 1.000000   1.000000 1.000000
0.000000 1.000000   1.000000 1.000000
0.000000 1.000000   1.000000 1.000000
0.000000 500.000000   1.000000 500.000000
0.000000 0.000000 0.000000   0.000000 0.000000 0.000000   0.000000 
0.000000 0.000000 
psys_lightning_7 256 lightning_7  4 0.250000 0.000000 0.000000 0.000000 0.000000 
0.500000 1.000000   1.000000 0.000000
0.000000 1.000000   1.000000 1.000000
0.000000 1.000000   1.000000 1.000000
0.000000 1.000000   1.000000 1.000000
0.000000 500.000000   1.000000 500.000000
0.000000 0.000000 0.000000   0.000000 0.000000 0.000000   0.000000 
0.000000 0.000000 
psys_lightning_8 256 lightning_8  4 0.250000 0.000000 0.000000 0.000000 0.000000 
0.500000 1.000000   1.000000 0.000000
0.000000 1.000000   1.000000 1.000000
0.000000 1.000000   1.000000 1.000000
0.000000 1.000000   1.000000 1.000000
0.000000 500.000000   1.000000 500.000000
0.000000 0.000000 0.000000   0.000000 0.000000 0.000000   0.000000 
0.000000 0.000000 
psys_upper_lightning 4608 prt_mesh_fire_3  4 0.250000 0.000000 0.000000 0.000000 0.000000 
0.500000 1.000000   1.000000 0.000000
0.000000 1.000000   1.000000 1.000000
0.000000 1.000000   1.000000 1.000000
0.000000 1.000000   1.000000 1.000000
0.000000 500.000000   1.000000 500.000000
0.000000 0.000000 0.000000   0.000000 0.000000 0.000000   0.000000 
0.000000 0.000000 
psys_fire_xs 12818 prt_mesh_fire_1  8 1.000000 0.000000 0.000000 0.000000 0.000000 
0.250000 1.000000   1.000000 0.000000
0.000000 1.000000   1.000000 0.900000
0.000000 0.700000   1.000000 0.300000
0.000000 0.200000   1.000000 0.000000
0.000000 0.250000   1.000000 0.125000
0.062500 0.062500 0.062500   0.000000 0.000000 0.500000   0.000000 
200.000000 0.200000 
psys_fire_s 12818 prt_mesh_fire_1  16 1.000000 0.000000 0.000000 0.000000 0.000000 
0.250000 1.000000   1.000000 0.000000
0.000000 1.000000   1.000000 0.900000
0.000000 0.700000   1.000000 0.300000
0.000000 0.200000   1.000000 0.000000
0.000000 0.375000   1.000000 0.187500
0.125000 0.125000 0.125000   0.000000 0.000000 0.750000   0.000000 
200.000000 0.200000 
psys_fire_m 12818 prt_mesh_fire_1  32 1.000000 0.000000 0.000000 0.000000 0.000000 
0.250000 1.000000   1.000000 0.000000
0.000000 1.000000   1.000000 0.900000
0.000000 0.700000   1.000000 0.300000
0.000000 0.200000   1.000000 0.000000
0.000000 0.562500   1.000000 0.281250
0.250000 0.250000 0.250000   0.000000 0.000000 1.125000   0.000000 
200.000000 0.200000 
psys_fire_l 12818 prt_mesh_fire_1  64 1.000000 0.000000 0.000000 0.000000 0.000000 
0.250000 1.000000   1.000000 0.000000
0.000000 1.000000   1.000000 0.900000
0.000000 0.700000   1.000000 0.300000
0.000000 0.200000   1.000000 0.000000
0.000000 0.843750   1.000000 0.421875
0.500000 0.500000 0.500000   0.000000 0.000000 1.687500   0.000000 
200.000000 0.200000 
psys_fire_xl 12818 prt_mesh_fire_1  128 1.000000 0.000000 0.000000 0.000000 0.000000 
0.250000 1.000000   1.000000 0.000000
0.000000 1.000000   1.000000 0.900000
0.000000 0.700000   1.000000 0.300000
0.000000 0.200000   1.000000 0.000000
0.000000 1.265625   1.000000 0.632812
1.000000 1.000000 1.000000   0.000000 0.000000 2.531250   0.000000 
200.000000 0.200000 
psys_smoke_xs 12818 prtcl_dust_b  4 2.000000 0.000000 0.000000 0.000000 0.000000 
0.500000 0.500000   1.000000 0.000000
0.000000 0.100000   1.000000 0.100000
0.000000 0.100000   1.000000 0.100000
0.000000 0.100000   1.000000 0.100000
0.000000 0.250000   1.000000 0.500000
0.062500 0.062500 0.062500   0.000000 0.000000 0.500000   0.000000 
100.000000 0.200000 
psys_smoke_s 12818 prtcl_dust_b  8 2.000000 0.000000 0.000000 0.000000 0.000000 
0.500000 0.500000   1.000000 0.000000
0.000000 0.100000   1.000000 0.100000
0.000000 0.100000   1.000000 0.100000
0.000000 0.100000   1.000000 0.100000
0.000000 0.375000   1.000000 0.750000
0.125000 0.125000 0.125000   0.000000 0.000000 0.750000   0.000000 
100.000000 0.200000 
psys_smoke_m 12818 prtcl_dust_b  16 2.000000 0.000000 0.000000 0.000000 0.000000 
0.500000 0.500000   1.000000 0.000000
0.000000 0.100000   1.000000 0.100000
0.000000 0.100000   1.000000 0.100000
0.000000 0.100000   1.000000 0.100000
0.000000 0.562500   1.000000 1.125000
0.250000 0.250000 0.250000   0.000000 0.000000 1.125000   0.000000 
100.000000 0.200000 
psys_smoke_l 12818 prtcl_dust_b  32 2.000000 0.000000 0.000000 0.000000 0.000000 
0.500000 0.500000   1.000000 0.000000
0.000000 0.100000   1.000000 0.100000
0.000000 0.100000   1.000000 0.100000
0.000000 0.100000   1.000000 0.100000
0.000000 0.843750   1.000000 1.687500
0.500000 0.500000 0.500000   0.000000 0.000000 1.687500   0.000000 
100.000000 0.200000 
psys_smoke_xl 12818 prtcl_dust_b  64 2.000000 0.000000 0.000000 0.000000 0.000000 
0.500000 0.500000   1.000000 0.000000
0.000000 0.100000   1.000000 0.100000
0.000000 0.100000   1.000000 0.100000
0.000000 0.100000   1.000000 0.100000
0.000000 1.265625   1.000000 2.531250
1.000000 1.000000 1.000000   0.000000 0.000000 2.531250   0.000000 
100.000000 0.200000 
