 gray_stone 5 ground_stone_a 8.000000 none 1.000000 1.000000 1.000000
 brown_stone 5 ground_patch_rock 8.000000 none 1.000000 1.000000 1.000000
 turf 5 ground_grassy 8.000000 none 1.000000 1.000000 1.000000
 steppe 7 ground_steppe 8.000000 none 1.000000 1.000000 1.000000
 snow 5 ground_snow 8.000000 none 1.000000 1.000000 1.000000
 earth 7 ground_earth 8.000000 none 1.000000 1.000000 1.000000
 desert 7 ground_desert 8.000000 none 1.000000 1.000000 1.000000
 forest 5 ground_forest 8.000000 none 1.000000 1.000000 1.000000
 pebbles 5 ground_pebbles 8.000000 none 1.000000 1.000000 1.000000
 village 5 ground_village 8.000000 none 1.000000 1.000000 1.000000
 path 7 ground_path 8.000000 none 1.000000 1.000000 1.000000
