1999
1999
/g/data/wb00/admin/testing/cds_era5/single-levels/reanalysis/tp/1999
/g/data/wb00/admin/testing/cds_era5/single-levels/reanalysis/tp/1999/tp_era5_oper_sfc_19990101-19990131.nc
/g/data/wb00/admin/testing/cds_era5/single-levels/reanalysis/tp/1999/tp_era5_oper_sfc_19990201-19990228.nc
/g/data/wb00/admin/testing/cds_era5/single-levels/reanalysis/tp/1999/tp_era5_oper_sfc_19990301-19990331.nc
/g/data/wb00/admin/testing/cds_era5/single-levels/reanalysis/tp/1999/tp_era5_oper_sfc_19990401-19990430.nc
/g/data/wb00/admin/testing/cds_era5/single-levels/reanalysis/tp/1999/tp_era5_oper_sfc_19990501-19990531.nc
/g/data/wb00/admin/testing/cds_era5/single-levels/reanalysis/tp/1999/tp_era5_oper_sfc_19990601-19990630.nc
/g/data/wb00/admin/testing/cds_era5/single-levels/reanalysis/tp/1999/tp_era5_oper_sfc_19990701-19990731.nc
/g/data/wb00/admin/testing/cds_era5/single-levels/reanalysis/tp/1999/tp_era5_oper_sfc_19990801-19990831.nc
/g/data/wb00/admin/testing/cds_era5/single-levels/reanalysis/tp/1999/tp_era5_oper_sfc_19990901-19990930.nc
/g/data/wb00/admin/testing/cds_era5/single-levels/reanalysis/tp/1999/tp_era5_oper_sfc_19991001-19991031.nc
/g/data/wb00/admin/testing/cds_era5/single-levels/reanalysis/tp/1999/tp_era5_oper_sfc_19991101-19991130.nc
/g/data/wb00/admin/testing/cds_era5/single-levels/reanalysis/tp/1999/tp_era5_oper_sfc_19991201-19991231.nc

======================================================================================
                  Resource Usage on 2023-05-20 08:21:12:
   Job Id:             84297910.gadi-pbs
   Project:            fp0
   Exit Status:        0
   Service Units:      28.66
   NCPUs Requested:    1                      NCPUs Used: 1               
                                           CPU Time Used: 00:04:41        
   Memory Requested:   15.0GB                Memory Used: 2.37GB          
   Walltime requested: 10:00:00            Walltime Used: 03:49:19        
   JobFS requested:    10.0GB                 JobFS used: 0B              
======================================================================================
