1972
1972
/g/data/wb00/admin/testing/cds_era5/single-levels/reanalysis/tp/1972
/g/data/wb00/admin/testing/cds_era5/single-levels/reanalysis/tp/1972/tp_era5_oper_sfc_19720101-19720131.nc
/g/data/wb00/admin/testing/cds_era5/single-levels/reanalysis/tp/1972/tp_era5_oper_sfc_19720201-19720228.nc
/g/data/wb00/admin/testing/cds_era5/single-levels/reanalysis/tp/1972/tp_era5_oper_sfc_19720301-19720331.nc
/g/data/wb00/admin/testing/cds_era5/single-levels/reanalysis/tp/1972/tp_era5_oper_sfc_19720401-19720430.nc
/g/data/wb00/admin/testing/cds_era5/single-levels/reanalysis/tp/1972/tp_era5_oper_sfc_19720501-19720531.nc
/g/data/wb00/admin/testing/cds_era5/single-levels/reanalysis/tp/1972/tp_era5_oper_sfc_19720601-19720630.nc
/g/data/wb00/admin/testing/cds_era5/single-levels/reanalysis/tp/1972/tp_era5_oper_sfc_19720701-19720731.nc
/g/data/wb00/admin/testing/cds_era5/single-levels/reanalysis/tp/1972/tp_era5_oper_sfc_19720801-19720831.nc
/g/data/wb00/admin/testing/cds_era5/single-levels/reanalysis/tp/1972/tp_era5_oper_sfc_19720901-19720930.nc
/g/data/wb00/admin/testing/cds_era5/single-levels/reanalysis/tp/1972/tp_era5_oper_sfc_19721001-19721031.nc
/g/data/wb00/admin/testing/cds_era5/single-levels/reanalysis/tp/1972/tp_era5_oper_sfc_19721101-19721130.nc
/g/data/wb00/admin/testing/cds_era5/single-levels/reanalysis/tp/1972/tp_era5_oper_sfc_19721201-19721231.nc

======================================================================================
                  Resource Usage on 2023-05-20 00:35:32:
   Job Id:             84297475.gadi-pbs
   Project:            fp0
   Exit Status:        0
   Service Units:      42.13
   NCPUs Requested:    1                      NCPUs Used: 1               
                                           CPU Time Used: 00:04:42        
   Memory Requested:   15.0GB                Memory Used: 7.59GB          
   Walltime requested: 10:00:00            Walltime Used: 05:37:04        
   JobFS requested:    10.0GB                 JobFS used: 0B              
======================================================================================
