1967
1967
/g/data/wb00/admin/testing/cds_era5/single-levels/reanalysis/tisr/1967
/g/data/wb00/admin/testing/cds_era5/single-levels/reanalysis/tisr/1967/tisr_era5_oper_sfc_19670101-19670131.nc
/g/data/wb00/admin/testing/cds_era5/single-levels/reanalysis/tisr/1967/tisr_era5_oper_sfc_19670201-19670228.nc
/g/data/wb00/admin/testing/cds_era5/single-levels/reanalysis/tisr/1967/tisr_era5_oper_sfc_19670301-19670331.nc
/g/data/wb00/admin/testing/cds_era5/single-levels/reanalysis/tisr/1967/tisr_era5_oper_sfc_19670401-19670430.nc
/g/data/wb00/admin/testing/cds_era5/single-levels/reanalysis/tisr/1967/tisr_era5_oper_sfc_19670501-19670531.nc
/g/data/wb00/admin/testing/cds_era5/single-levels/reanalysis/tisr/1967/tisr_era5_oper_sfc_19670601-19670630.nc
/g/data/wb00/admin/testing/cds_era5/single-levels/reanalysis/tisr/1967/tisr_era5_oper_sfc_19670701-19670731.nc
/g/data/wb00/admin/testing/cds_era5/single-levels/reanalysis/tisr/1967/tisr_era5_oper_sfc_19670801-19670831.nc
/g/data/wb00/admin/testing/cds_era5/single-levels/reanalysis/tisr/1967/tisr_era5_oper_sfc_19670901-19670930.nc
/g/data/wb00/admin/testing/cds_era5/single-levels/reanalysis/tisr/1967/tisr_era5_oper_sfc_19671001-19671031.nc
/g/data/wb00/admin/testing/cds_era5/single-levels/reanalysis/tisr/1967/tisr_era5_oper_sfc_19671101-19671130.nc
/g/data/wb00/admin/testing/cds_era5/single-levels/reanalysis/tisr/1967/tisr_era5_oper_sfc_19671201-19671231.nc

======================================================================================
                  Resource Usage on 2023-05-19 16:34:01:
   Job Id:             84190595.gadi-pbs
   Project:            fp0
   Exit Status:        0
   Service Units:      24.09
   NCPUs Requested:    1                      NCPUs Used: 1               
                                           CPU Time Used: 00:04:58        
   Memory Requested:   10.0GB                Memory Used: 2.13GB          
   Walltime requested: 10:00:00            Walltime Used: 04:49:05        
   JobFS requested:    10.0GB                 JobFS used: 0B              
======================================================================================
