Loading NCI-ai-ml/23.10
  Loading requirement: singularity openmpi/4.1.5
Traceback (most recent call last):
  File "/g/data/wb00/admin/testing/NCI_weatherbench/NCI_notebooks_v3/scripts_model_3/3b.cnn-example-5.625_model_3_3d.py", line 11, in <module>
    os.chdir(f'{NOTEBOOK_PATH}/scripts')
FileNotFoundError: [Errno 2] No such file or directory: '/g/data/wb00/admin/testing/NCI_weatherbench/NCI_notebooks_v3/scripts'
