Loading NCI-ai-ml/23.10
  Loading requirement: singularity openmpi/4.1.5
2024-03-18 02:27:35.127585: I tensorflow/core/platform/cpu_feature_guard.cc:182] This TensorFlow binary is optimized to use available CPU instructions in performance-critical operations.
To enable the following instructions: AVX2 AVX512F AVX512_VNNI FMA, in other operations, rebuild TensorFlow with the appropriate compiler flags.
2024-03-18 02:27:42.696295: I tensorflow/core/common_runtime/gpu/gpu_device.cc:1639] Created device /job:localhost/replica:0/task:0/device:GPU:0 with 31141 MB memory:  -> device: 0, name: Tesla V100-SXM2-32GB, pci bus id: 0000:3e:00.0, compute capability: 7.0
2024-03-18 02:34:24.798569: I tensorflow/core/common_runtime/gpu/gpu_device.cc:1639] Created device /job:localhost/replica:0/task:0/device:GPU:0 with 31141 MB memory:  -> device: 0, name: Tesla V100-SXM2-32GB, pci bus id: 0000:3e:00.0, compute capability: 7.0
2024-03-18 02:34:28.244144: I tensorflow/compiler/xla/stream_executor/cuda/cuda_dnn.cc:432] Loaded cuDNN version 8800
2024-03-18 02:34:29.690190: I tensorflow/compiler/xla/service/service.cc:168] XLA service 0x564a495e4830 initialized for platform CUDA (this does not guarantee that XLA will be used). Devices:
2024-03-18 02:34:29.690216: I tensorflow/compiler/xla/service/service.cc:176]   StreamExecutor device (0): Tesla V100-SXM2-32GB, Compute Capability 7.0
2024-03-18 02:34:29.831796: I tensorflow/compiler/mlir/tensorflow/utils/dump_mlir_util.cc:255] disabling MLIR crash reproducer, set env var `MLIR_CRASH_REPRODUCER_DIRECTORY` to enable.
2024-03-18 02:34:30.300578: I ./tensorflow/compiler/jit/device_compiler.h:186] Compiled cluster using XLA!  This line is logged at most once for the lifetime of the process.
WARNING:tensorflow:Keras is training/fitting/evaluating on array-like data. Keras may not be optimized for this format, so if your input data format is supported by TensorFlow I/O (https://github.com/tensorflow/io) we recommend using that to load a Dataset instead.
distributed.nanny - WARNING - Worker process still alive after 3.199998474121094 seconds, killing
distributed.nanny - WARNING - Worker process still alive after 3.1999990844726565 seconds, killing
distributed.nanny - WARNING - Worker process still alive after 3.1999986267089846 seconds, killing
distributed.nanny - WARNING - Worker process still alive after 3.1999987792968754 seconds, killing
distributed.nanny - WARNING - Worker process still alive after 3.199999389648438 seconds, killing
distributed.nanny - WARNING - Worker process still alive after 3.1999992370605472 seconds, killing
distributed.nanny - WARNING - Worker process still alive after 3.1999986267089846 seconds, killing
distributed.nanny - WARNING - Worker process still alive after 3.1999992370605472 seconds, killing
distributed.nanny - WARNING - Worker process still alive after 3.1999990844726565 seconds, killing
distributed.nanny - WARNING - Worker process still alive after 3.1999990844726565 seconds, killing
distributed.nanny - WARNING - Worker process still alive after 3.1999992370605472 seconds, killing
distributed.nanny - WARNING - Worker process still alive after 3.1999992370605472 seconds, killing
