2019
2019
/g/data/wb00/admin/testing/cds_era5/single-levels/reanalysis/tp/2019
/g/data/wb00/admin/testing/cds_era5/single-levels/reanalysis/tp/2019/tp_era5_oper_sfc_20190101-20190131.nc
/g/data/wb00/admin/testing/cds_era5/single-levels/reanalysis/tp/2019/tp_era5_oper_sfc_20190201-20190228.nc
/g/data/wb00/admin/testing/cds_era5/single-levels/reanalysis/tp/2019/tp_era5_oper_sfc_20190301-20190331.nc
/g/data/wb00/admin/testing/cds_era5/single-levels/reanalysis/tp/2019/tp_era5_oper_sfc_20190401-20190430.nc
/g/data/wb00/admin/testing/cds_era5/single-levels/reanalysis/tp/2019/tp_era5_oper_sfc_20190501-20190531.nc
/g/data/wb00/admin/testing/cds_era5/single-levels/reanalysis/tp/2019/tp_era5_oper_sfc_20190601-20190630.nc

======================================================================================
                  Resource Usage on 2023-05-20 18:50:04:
   Job Id:             84298242.gadi-pbs
   Project:            fp0
   Exit Status:        271 (Linux Signal 15 SIGTERM Termination)
   Service Units:      75.04
   NCPUs Requested:    1                      NCPUs Used: 1               
                                           CPU Time Used: 00:02:27        
   Memory Requested:   15.0GB                Memory Used: 3.56GB          
   Walltime requested: 10:00:00            Walltime Used: 10:00:18        
   JobFS requested:    10.0GB                 JobFS used: 0B              
======================================================================================
