Loading NCI-ai-ml/23.10
  Loading requirement: singularity openmpi/4.1.5
2024-03-17 02:57:40.563234: I tensorflow/core/platform/cpu_feature_guard.cc:182] This TensorFlow binary is optimized to use available CPU instructions in performance-critical operations.
To enable the following instructions: AVX2 AVX512F AVX512_VNNI FMA, in other operations, rebuild TensorFlow with the appropriate compiler flags.
2024-03-17 02:57:46.867431: I tensorflow/core/common_runtime/gpu/gpu_device.cc:1639] Created device /job:localhost/replica:0/task:0/device:GPU:0 with 31141 MB memory:  -> device: 0, name: Tesla V100-SXM2-32GB, pci bus id: 0000:b1:00.0, compute capability: 7.0
2024-03-17 03:02:46.878401: I tensorflow/core/common_runtime/gpu/gpu_device.cc:1639] Created device /job:localhost/replica:0/task:0/device:GPU:0 with 31141 MB memory:  -> device: 0, name: Tesla V100-SXM2-32GB, pci bus id: 0000:b1:00.0, compute capability: 7.0
2024-03-17 03:02:50.189846: I tensorflow/compiler/xla/stream_executor/cuda/cuda_dnn.cc:432] Loaded cuDNN version 8800
2024-03-17 03:02:54.590280: I tensorflow/compiler/xla/service/service.cc:168] XLA service 0x14f278040240 initialized for platform CUDA (this does not guarantee that XLA will be used). Devices:
2024-03-17 03:02:54.590305: I tensorflow/compiler/xla/service/service.cc:176]   StreamExecutor device (0): Tesla V100-SXM2-32GB, Compute Capability 7.0
2024-03-17 03:02:54.686898: I tensorflow/compiler/mlir/tensorflow/utils/dump_mlir_util.cc:255] disabling MLIR crash reproducer, set env var `MLIR_CRASH_REPRODUCER_DIRECTORY` to enable.
2024-03-17 03:02:55.053399: I ./tensorflow/compiler/jit/device_compiler.h:186] Compiled cluster using XLA!  This line is logged at most once for the lifetime of the process.
=>> PBS: job killed: walltime 172902 exceeded limit 172800
/opt/conda/envs/mlenv/lib/python3.9/multiprocessing/resource_tracker.py:216: UserWarning: resource_tracker: There appear to be 72 leaked semaphore objects to clean up at shutdown
  warnings.warn('resource_tracker: There appear to be %d '
