
======================   ALLOCATED NODES   ======================
	gadi-cpu-spr-0059: flags=0x11 slots=104 max_slots=0 slots_inuse=0 state=UP
	gadi-cpu-spr-0064: flags=0x13 slots=104 max_slots=0 slots_inuse=0 state=UP
	gadi-cpu-spr-0065: flags=0x13 slots=104 max_slots=0 slots_inuse=0 state=UP
	gadi-cpu-spr-0067: flags=0x13 slots=104 max_slots=0 slots_inuse=0 state=UP
=================================================================
App launch reported: 4 (out of 4) daemons - 3 (out of 4) procs
rank: 0     host: gadi-cpu-spr-0059.gadi.nci.org.au ( local task: 0  u) 
rank: 1     host: gadi-cpu-spr-0059.gadi.nci.org.au ( local task: 1  u) 
rank: 2     host: gadi-cpu-spr-0059.gadi.nci.org.au ( local task: 2  u) 
rank: 3     host: gadi-cpu-spr-0059.gadi.nci.org.au ( local task: 3  u) 
rank: 4     host: gadi-cpu-spr-0059.gadi.nci.org.au ( local task: 4  u) 
rank: 5     host: gadi-cpu-spr-0059.gadi.nci.org.au ( local task: 5  u) 
rank: 6     host: gadi-cpu-spr-0059.gadi.nci.org.au ( local task: 6  u) 
rank: 7     host: gadi-cpu-spr-0059.gadi.nci.org.au ( local task: 7  u) 
rank: 8     host: gadi-cpu-spr-0059.gadi.nci.org.au ( local task: 8  u) 
rank: 9     host: gadi-cpu-spr-0059.gadi.nci.org.au ( local task: 9  u) 
rank: 10    host: gadi-cpu-spr-0064.gadi.nci.org.au ( local task: 0  u) 
rank: 11    host: gadi-cpu-spr-0064.gadi.nci.org.au ( local task: 1  u) 
rank: 12    host: gadi-cpu-spr-0064.gadi.nci.org.au ( local task: 2  u) 
rank: 13    host: gadi-cpu-spr-0064.gadi.nci.org.au ( local task: 3  u) 
rank: 14    host: gadi-cpu-spr-0064.gadi.nci.org.au ( local task: 4  u) 
rank: 15    host: gadi-cpu-spr-0064.gadi.nci.org.au ( local task: 5  u) 
rank: 16    host: gadi-cpu-spr-0064.gadi.nci.org.au ( local task: 6  u) 
rank: 17    host: gadi-cpu-spr-0064.gadi.nci.org.au ( local task: 7  u) 
rank: 18    host: gadi-cpu-spr-0064.gadi.nci.org.au ( local task: 8  u) 
rank: 19    host: gadi-cpu-spr-0064.gadi.nci.org.au ( local task: 9  u) 
rank: 20    host: gadi-cpu-spr-0065.gadi.nci.org.au ( local task: 0  u) 
rank: 21    host: gadi-cpu-spr-0065.gadi.nci.org.au ( local task: 1  u) 
rank: 22    host: gadi-cpu-spr-0065.gadi.nci.org.au ( local task: 2  u) 
rank: 23    host: gadi-cpu-spr-0065.gadi.nci.org.au ( local task: 3  u) 
rank: 24    host: gadi-cpu-spr-0065.gadi.nci.org.au ( local task: 4  u) 
rank: 25    host: gadi-cpu-spr-0065.gadi.nci.org.au ( local task: 5  u) 
rank: 26    host: gadi-cpu-spr-0065.gadi.nci.org.au ( local task: 6  u) 
rank: 27    host: gadi-cpu-spr-0065.gadi.nci.org.au ( local task: 7  u) 
rank: 28    host: gadi-cpu-spr-0065.gadi.nci.org.au ( local task: 8  u) 
rank: 29    host: gadi-cpu-spr-0065.gadi.nci.org.au ( local task: 9  u) 
rank: 30    host: gadi-cpu-spr-0067.gadi.nci.org.au ( local task: 0  u) 
rank: 31    host: gadi-cpu-spr-0067.gadi.nci.org.au ( local task: 1  u) 
rank: 32    host: gadi-cpu-spr-0067.gadi.nci.org.au ( local task: 2  u) 
rank: 33    host: gadi-cpu-spr-0067.gadi.nci.org.au ( local task: 3  u) 
rank: 34    host: gadi-cpu-spr-0067.gadi.nci.org.au ( local task: 4  u) 
rank: 35    host: gadi-cpu-spr-0067.gadi.nci.org.au ( local task: 5  u) 
rank: 36    host: gadi-cpu-spr-0067.gadi.nci.org.au ( local task: 6  u) 
rank: 37    host: gadi-cpu-spr-0067.gadi.nci.org.au ( local task: 7  u) 
rank: 38    host: gadi-cpu-spr-0067.gadi.nci.org.au ( local task: 8  u) 
rank: 39    host: gadi-cpu-spr-0067.gadi.nci.org.au ( local task: 9  u) 
╔════════════════════════════════════════════════════════════════════════════════════════════════════════════════════════╗
║ ╔════════════════════════════════════════════════════════════════════════════════════════════════════════════════════╗ ║
║ ║                                                    Common Param                                                    ║ ║
║ ║           ERA_param ▶ t                                                                                            ║ ║
║ ║    config_file_path ▶ /scratch/fp0/mah900/WeatherBench/pbs_scripts/config_test.yaml                                ║ ║
║ ║             out_deg ▶ 5.625000                                                                                     ║ ║
║ ║           algorithm ▶ bilinear                                                                                     ║ ║
║ ║      pressure_level ▶ [50, 100, 150, 200, 250, 300, 400, 500, 600, 700, 850, 925, 1000]                            ║ ║
║ ║       in_dir_prefix ▶ /g/data/rt52/era5/pressure-levels/reanalysis/t                                               ║ ║
║ ║     out_file_prefix ▶ /g/data/wb00/admin/testing/nci_5.625/test_test/temperature                                   ║ ║
║ ╚════════════════════════════════════════════════════════════════════════════════════════════════════════════════════╝ ║
╚════════════════════════════════════════════════════════════════════════════════════════════════════════════════════════╝


┌────────────────────────────────────────────────────────────────────────────────────────────────────────────────────────┐
┊                                                Fri Mar 31 02:16:00 2023                                                ┊
┊                rank ▻ 0                                                                                                ┊
┊                node ▻ gadi-cpu-spr-0059.gadi.nci.org.au                                                                ┊
┊                year ▻ 1979                                                                                             ┊
┊              in_dir ▻ /g/data/rt52/era5/pressure-levels/reanalysis/t/1979/*                                            ┊
┊            out_file ▻ /g/data/wb00/admin/testing/nci_5.625/test_test/temperature_1979_5.625.nc                         ┊
└────────────────────────────────────────────────────────────────────────────────────────────────────────────────────────┘
<xarray.Dataset>
Dimensions:    (longitude: 1440, latitude: 721, level: 37, time: 8760)
Coordinates:
  * longitude  (longitude) float32 -180.0 -179.8 -179.5 ... 179.2 179.5 179.8
  * latitude   (latitude) float32 90.0 89.75 89.5 89.25 ... -89.5 -89.75 -90.0
  * level      (level) int32 1 2 3 5 7 10 20 30 ... 850 875 900 925 950 975 1000
  * time       (time) datetime64[ns] 1979-01-01 ... 1979-12-31T23:00:00
Data variables:
    t          (time, level, latitude, longitude) float32 dask.array<chunksize=(744, 37, 721, 1440), meta=np.ndarray>
Attributes:
    Conventions:  CF-1.6
    license:      Licence to use Copernicus Products: https://apps.ecmwf.int/...
    summary:      ERA5 is the fifth generation ECMWF atmospheric reanalysis o...
    title:        ERA5 pressure-levels oper temperature 19790101-19790131
    history:      2021-01-08 07:36:24 UTC+1100 by era5_replication_tools-1.8....
━━━━━━━━━━━━━━━━━━━━━━━━━━━━━━━━━━━━━━━━━━━━━━━━━━━━━━━━━━━━━━━━━━━━━━━━━━━━━━━━━━━━━━━━━━━━━━━━━━━━━━━━━━━━━━━━━━━━━━━━━━


┌────────────────────────────────────────────────────────────────────────────────────────────────────────────────────────┐
┊                                                Fri Mar 31 02:16:05 2023                                                ┊
┊                rank ▻ 1                                                                                                ┊
┊                node ▻ gadi-cpu-spr-0059.gadi.nci.org.au                                                                ┊
┊                year ▻ 1980                                                                                             ┊
┊              in_dir ▻ /g/data/rt52/era5/pressure-levels/reanalysis/t/1980/*                                            ┊
┊            out_file ▻ /g/data/wb00/admin/testing/nci_5.625/test_test/temperature_1980_5.625.nc                         ┊
└────────────────────────────────────────────────────────────────────────────────────────────────────────────────────────┘
<xarray.Dataset>
Dimensions:    (longitude: 1440, latitude: 721, level: 37, time: 8784)
Coordinates:
  * longitude  (longitude) float32 -180.0 -179.8 -179.5 ... 179.2 179.5 179.8
  * latitude   (latitude) float32 90.0 89.75 89.5 89.25 ... -89.5 -89.75 -90.0
  * level      (level) int32 1 2 3 5 7 10 20 30 ... 850 875 900 925 950 975 1000
  * time       (time) datetime64[ns] 1980-01-01 ... 1980-12-31T23:00:00
Data variables:
    t          (time, level, latitude, longitude) float32 dask.array<chunksize=(744, 37, 721, 1440), meta=np.ndarray>
Attributes:
    Conventions:  CF-1.6
    history:      2020-11-06 15:50:54 UTC+1100 by era5_replication_tools-1.2....
    license:      Licence to use Copernicus Products: https://apps.ecmwf.int/...
    summary:      ERA5 is the fifth generation ECMWF atmospheric reanalysis o...
    title:        ERA5 pressure-levels oper temperature 19800101-19800131
━━━━━━━━━━━━━━━━━━━━━━━━━━━━━━━━━━━━━━━━━━━━━━━━━━━━━━━━━━━━━━━━━━━━━━━━━━━━━━━━━━━━━━━━━━━━━━━━━━━━━━━━━━━━━━━━━━━━━━━━━━


┌────────────────────────────────────────────────────────────────────────────────────────────────────────────────────────┐
┊                                                Fri Mar 31 02:16:07 2023                                                ┊
┊                rank ▻ 2                                                                                                ┊
┊                node ▻ gadi-cpu-spr-0059.gadi.nci.org.au                                                                ┊
┊                year ▻ 1981                                                                                             ┊
┊              in_dir ▻ /g/data/rt52/era5/pressure-levels/reanalysis/t/1981/*                                            ┊
┊            out_file ▻ /g/data/wb00/admin/testing/nci_5.625/test_test/temperature_1981_5.625.nc                         ┊
└────────────────────────────────────────────────────────────────────────────────────────────────────────────────────────┘
<xarray.Dataset>
Dimensions:    (longitude: 1440, latitude: 721, level: 37, time: 8760)
Coordinates:
  * longitude  (longitude) float32 -180.0 -179.8 -179.5 ... 179.2 179.5 179.8
  * latitude   (latitude) float32 90.0 89.75 89.5 89.25 ... -89.5 -89.75 -90.0
  * level      (level) int32 1 2 3 5 7 10 20 30 ... 850 875 900 925 950 975 1000
  * time       (time) datetime64[ns] 1981-01-01 ... 1981-12-31T23:00:00
Data variables:
    t          (time, level, latitude, longitude) float32 dask.array<chunksize=(744, 37, 721, 1440), meta=np.ndarray>
Attributes:
    Conventions:  CF-1.6
    history:      2020-11-05 21:33:12 UTC+1100 by era5_replication_tools-1.2....
    license:      Licence to use Copernicus Products: https://apps.ecmwf.int/...
    summary:      ERA5 is the fifth generation ECMWF atmospheric reanalysis o...
    title:        ERA5 pressure-levels oper temperature 19810101-19810131
━━━━━━━━━━━━━━━━━━━━━━━━━━━━━━━━━━━━━━━━━━━━━━━━━━━━━━━━━━━━━━━━━━━━━━━━━━━━━━━━━━━━━━━━━━━━━━━━━━━━━━━━━━━━━━━━━━━━━━━━━━


┌────────────────────────────────────────────────────────────────────────────────────────────────────────────────────────┐
┊                                                Fri Mar 31 02:16:09 2023                                                ┊
┊                rank ▻ 3                                                                                                ┊
┊                node ▻ gadi-cpu-spr-0059.gadi.nci.org.au                                                                ┊
┊                year ▻ 1982                                                                                             ┊
┊              in_dir ▻ /g/data/rt52/era5/pressure-levels/reanalysis/t/1982/*                                            ┊
┊            out_file ▻ /g/data/wb00/admin/testing/nci_5.625/test_test/temperature_1982_5.625.nc                         ┊
└────────────────────────────────────────────────────────────────────────────────────────────────────────────────────────┘
<xarray.Dataset>
Dimensions:    (longitude: 1440, latitude: 721, level: 37, time: 8760)
Coordinates:
  * longitude  (longitude) float32 -180.0 -179.8 -179.5 ... 179.2 179.5 179.8
  * latitude   (latitude) float32 90.0 89.75 89.5 89.25 ... -89.5 -89.75 -90.0
  * level      (level) int32 1 2 3 5 7 10 20 30 ... 850 875 900 925 950 975 1000
  * time       (time) datetime64[ns] 1982-01-01 ... 1982-12-31T23:00:00
Data variables:
    t          (time, level, latitude, longitude) float32 dask.array<chunksize=(744, 37, 721, 1440), meta=np.ndarray>
Attributes:
    Conventions:  CF-1.6
    history:      2020-11-04 23:37:17 UTC+1100 by era5_replication_tools-1.2....
    license:      Licence to use Copernicus Products: https://apps.ecmwf.int/...
    summary:      ERA5 is the fifth generation ECMWF atmospheric reanalysis o...
    title:        ERA5 pressure-levels oper temperature 19820101-19820131
━━━━━━━━━━━━━━━━━━━━━━━━━━━━━━━━━━━━━━━━━━━━━━━━━━━━━━━━━━━━━━━━━━━━━━━━━━━━━━━━━━━━━━━━━━━━━━━━━━━━━━━━━━━━━━━━━━━━━━━━━━


┌────────────────────────────────────────────────────────────────────────────────────────────────────────────────────────┐
┊                                                Fri Mar 31 02:16:11 2023                                                ┊
┊                rank ▻ 4                                                                                                ┊
┊                node ▻ gadi-cpu-spr-0059.gadi.nci.org.au                                                                ┊
┊                year ▻ 1983                                                                                             ┊
┊              in_dir ▻ /g/data/rt52/era5/pressure-levels/reanalysis/t/1983/*                                            ┊
┊            out_file ▻ /g/data/wb00/admin/testing/nci_5.625/test_test/temperature_1983_5.625.nc                         ┊
└────────────────────────────────────────────────────────────────────────────────────────────────────────────────────────┘
<xarray.Dataset>
Dimensions:    (longitude: 1440, latitude: 721, level: 37, time: 8760)
Coordinates:
  * longitude  (longitude) float32 -180.0 -179.8 -179.5 ... 179.2 179.5 179.8
  * latitude   (latitude) float32 90.0 89.75 89.5 89.25 ... -89.5 -89.75 -90.0
  * level      (level) int32 1 2 3 5 7 10 20 30 ... 850 875 900 925 950 975 1000
  * time       (time) datetime64[ns] 1983-01-01 ... 1983-12-31T23:00:00
Data variables:
    t          (time, level, latitude, longitude) float32 dask.array<chunksize=(744, 37, 721, 1440), meta=np.ndarray>
Attributes:
    Conventions:  CF-1.6
    history:      2020-11-04 08:37:37 UTC+1100 by era5_replication_tools-1.2....
    license:      Licence to use Copernicus Products: https://apps.ecmwf.int/...
    summary:      ERA5 is the fifth generation ECMWF atmospheric reanalysis o...
    title:        ERA5 pressure-levels oper temperature 19830101-19830131
━━━━━━━━━━━━━━━━━━━━━━━━━━━━━━━━━━━━━━━━━━━━━━━━━━━━━━━━━━━━━━━━━━━━━━━━━━━━━━━━━━━━━━━━━━━━━━━━━━━━━━━━━━━━━━━━━━━━━━━━━━


┌────────────────────────────────────────────────────────────────────────────────────────────────────────────────────────┐
┊                                                Fri Mar 31 02:16:13 2023                                                ┊
┊                rank ▻ 5                                                                                                ┊
┊                node ▻ gadi-cpu-spr-0059.gadi.nci.org.au                                                                ┊
┊                year ▻ 1984                                                                                             ┊
┊              in_dir ▻ /g/data/rt52/era5/pressure-levels/reanalysis/t/1984/*                                            ┊
┊            out_file ▻ /g/data/wb00/admin/testing/nci_5.625/test_test/temperature_1984_5.625.nc                         ┊
└────────────────────────────────────────────────────────────────────────────────────────────────────────────────────────┘
<xarray.Dataset>
Dimensions:    (longitude: 1440, latitude: 721, level: 37, time: 8784)
Coordinates:
  * longitude  (longitude) float32 -180.0 -179.8 -179.5 ... 179.2 179.5 179.8
  * latitude   (latitude) float32 90.0 89.75 89.5 89.25 ... -89.5 -89.75 -90.0
  * level      (level) int32 1 2 3 5 7 10 20 30 ... 850 875 900 925 950 975 1000
  * time       (time) datetime64[ns] 1984-01-01 ... 1984-12-31T23:00:00
Data variables:
    t          (time, level, latitude, longitude) float32 dask.array<chunksize=(744, 37, 721, 1440), meta=np.ndarray>
Attributes:
    Conventions:  CF-1.6
    history:      2020-11-03 14:14:22 UTC+1100 by era5_replication_tools-1.2....
    license:      Licence to use Copernicus Products: https://apps.ecmwf.int/...
    summary:      ERA5 is the fifth generation ECMWF atmospheric reanalysis o...
    title:        ERA5 pressure-levels oper temperature 19840101-19840131
━━━━━━━━━━━━━━━━━━━━━━━━━━━━━━━━━━━━━━━━━━━━━━━━━━━━━━━━━━━━━━━━━━━━━━━━━━━━━━━━━━━━━━━━━━━━━━━━━━━━━━━━━━━━━━━━━━━━━━━━━━


┌────────────────────────────────────────────────────────────────────────────────────────────────────────────────────────┐
┊                                                Fri Mar 31 02:16:15 2023                                                ┊
┊                rank ▻ 6                                                                                                ┊
┊                node ▻ gadi-cpu-spr-0059.gadi.nci.org.au                                                                ┊
┊                year ▻ 1985                                                                                             ┊
┊              in_dir ▻ /g/data/rt52/era5/pressure-levels/reanalysis/t/1985/*                                            ┊
┊            out_file ▻ /g/data/wb00/admin/testing/nci_5.625/test_test/temperature_1985_5.625.nc                         ┊
└────────────────────────────────────────────────────────────────────────────────────────────────────────────────────────┘
<xarray.Dataset>
Dimensions:    (longitude: 1440, latitude: 721, level: 37, time: 8760)
Coordinates:
  * longitude  (longitude) float32 -180.0 -179.8 -179.5 ... 179.2 179.5 179.8
  * latitude   (latitude) float32 90.0 89.75 89.5 89.25 ... -89.5 -89.75 -90.0
  * level      (level) int32 1 2 3 5 7 10 20 30 ... 850 875 900 925 950 975 1000
  * time       (time) datetime64[ns] 1985-01-01 ... 1985-12-31T23:00:00
Data variables:
    t          (time, level, latitude, longitude) float32 dask.array<chunksize=(744, 37, 721, 1440), meta=np.ndarray>
Attributes:
    Conventions:  CF-1.6
    history:      2020-11-02 20:05:29 UTC+1100 by era5_replication_tools-1.2....
    license:      Licence to use Copernicus Products: https://apps.ecmwf.int/...
    summary:      ERA5 is the fifth generation ECMWF atmospheric reanalysis o...
    title:        ERA5 pressure-levels oper temperature 19850101-19850131
━━━━━━━━━━━━━━━━━━━━━━━━━━━━━━━━━━━━━━━━━━━━━━━━━━━━━━━━━━━━━━━━━━━━━━━━━━━━━━━━━━━━━━━━━━━━━━━━━━━━━━━━━━━━━━━━━━━━━━━━━━


┌────────────────────────────────────────────────────────────────────────────────────────────────────────────────────────┐
┊                                                Fri Mar 31 02:16:17 2023                                                ┊
┊                rank ▻ 7                                                                                                ┊
┊                node ▻ gadi-cpu-spr-0059.gadi.nci.org.au                                                                ┊
┊                year ▻ 1986                                                                                             ┊
┊              in_dir ▻ /g/data/rt52/era5/pressure-levels/reanalysis/t/1986/*                                            ┊
┊            out_file ▻ /g/data/wb00/admin/testing/nci_5.625/test_test/temperature_1986_5.625.nc                         ┊
└────────────────────────────────────────────────────────────────────────────────────────────────────────────────────────┘
<xarray.Dataset>
Dimensions:    (longitude: 1440, latitude: 721, level: 37, time: 8760)
Coordinates:
  * longitude  (longitude) float32 -180.0 -179.8 -179.5 ... 179.2 179.5 179.8
  * latitude   (latitude) float32 90.0 89.75 89.5 89.25 ... -89.5 -89.75 -90.0
  * level      (level) int32 1 2 3 5 7 10 20 30 ... 850 875 900 925 950 975 1000
  * time       (time) datetime64[ns] 1986-01-01 ... 1986-12-31T23:00:00
Data variables:
    t          (time, level, latitude, longitude) float32 dask.array<chunksize=(744, 37, 721, 1440), meta=np.ndarray>
Attributes:
    Conventions:  CF-1.6
    history:      2020-11-02 04:20:05 UTC+1100 by era5_replication_tools-1.2....
    license:      Licence to use Copernicus Products: https://apps.ecmwf.int/...
    summary:      ERA5 is the fifth generation ECMWF atmospheric reanalysis o...
    title:        ERA5 pressure-levels oper temperature 19860101-19860131
━━━━━━━━━━━━━━━━━━━━━━━━━━━━━━━━━━━━━━━━━━━━━━━━━━━━━━━━━━━━━━━━━━━━━━━━━━━━━━━━━━━━━━━━━━━━━━━━━━━━━━━━━━━━━━━━━━━━━━━━━━


┌────────────────────────────────────────────────────────────────────────────────────────────────────────────────────────┐
┊                                                Fri Mar 31 02:16:19 2023                                                ┊
┊                rank ▻ 8                                                                                                ┊
┊                node ▻ gadi-cpu-spr-0059.gadi.nci.org.au                                                                ┊
┊                year ▻ 1987                                                                                             ┊
┊              in_dir ▻ /g/data/rt52/era5/pressure-levels/reanalysis/t/1987/*                                            ┊
┊            out_file ▻ /g/data/wb00/admin/testing/nci_5.625/test_test/temperature_1987_5.625.nc                         ┊
└────────────────────────────────────────────────────────────────────────────────────────────────────────────────────────┘
<xarray.Dataset>
Dimensions:    (longitude: 1440, latitude: 721, level: 37, time: 8760)
Coordinates:
  * longitude  (longitude) float32 -180.0 -179.8 -179.5 ... 179.2 179.5 179.8
  * latitude   (latitude) float32 90.0 89.75 89.5 89.25 ... -89.5 -89.75 -90.0
  * level      (level) int32 1 2 3 5 7 10 20 30 ... 850 875 900 925 950 975 1000
  * time       (time) datetime64[ns] 1987-01-01 ... 1987-12-31T23:00:00
Data variables:
    t          (time, level, latitude, longitude) float32 dask.array<chunksize=(744, 37, 721, 1440), meta=np.ndarray>
Attributes:
    Conventions:  CF-1.6
    history:      2020-11-01 13:33:06 UTC+1100 by era5_replication_tools-1.2....
    license:      Licence to use Copernicus Products: https://apps.ecmwf.int/...
    summary:      ERA5 is the fifth generation ECMWF atmospheric reanalysis o...
    title:        ERA5 pressure-levels oper temperature 19870101-19870131
━━━━━━━━━━━━━━━━━━━━━━━━━━━━━━━━━━━━━━━━━━━━━━━━━━━━━━━━━━━━━━━━━━━━━━━━━━━━━━━━━━━━━━━━━━━━━━━━━━━━━━━━━━━━━━━━━━━━━━━━━━


┌────────────────────────────────────────────────────────────────────────────────────────────────────────────────────────┐
┊                                                Fri Mar 31 02:16:21 2023                                                ┊
┊                rank ▻ 9                                                                                                ┊
┊                node ▻ gadi-cpu-spr-0059.gadi.nci.org.au                                                                ┊
┊                year ▻ 1988                                                                                             ┊
┊              in_dir ▻ /g/data/rt52/era5/pressure-levels/reanalysis/t/1988/*                                            ┊
┊            out_file ▻ /g/data/wb00/admin/testing/nci_5.625/test_test/temperature_1988_5.625.nc                         ┊
└────────────────────────────────────────────────────────────────────────────────────────────────────────────────────────┘
<xarray.Dataset>
Dimensions:    (longitude: 1440, latitude: 721, level: 37, time: 8784)
Coordinates:
  * longitude  (longitude) float32 -180.0 -179.8 -179.5 ... 179.2 179.5 179.8
  * latitude   (latitude) float32 90.0 89.75 89.5 89.25 ... -89.5 -89.75 -90.0
  * level      (level) int32 1 2 3 5 7 10 20 30 ... 850 875 900 925 950 975 1000
  * time       (time) datetime64[ns] 1988-01-01 ... 1988-12-31T23:00:00
Data variables:
    t          (time, level, latitude, longitude) float32 dask.array<chunksize=(744, 37, 721, 1440), meta=np.ndarray>
Attributes:
    Conventions:  CF-1.6
    history:      2020-10-31 20:31:22 UTC+1100 by era5_replication_tools-1.2....
    license:      Licence to use Copernicus Products: https://apps.ecmwf.int/...
    summary:      ERA5 is the fifth generation ECMWF atmospheric reanalysis o...
    title:        ERA5 pressure-levels oper temperature 19880101-19880131
━━━━━━━━━━━━━━━━━━━━━━━━━━━━━━━━━━━━━━━━━━━━━━━━━━━━━━━━━━━━━━━━━━━━━━━━━━━━━━━━━━━━━━━━━━━━━━━━━━━━━━━━━━━━━━━━━━━━━━━━━━


┌────────────────────────────────────────────────────────────────────────────────────────────────────────────────────────┐
┊                                                Fri Mar 31 02:16:23 2023                                                ┊
┊                rank ▻ 10                                                                                               ┊
┊                node ▻ gadi-cpu-spr-0064.gadi.nci.org.au                                                                ┊
┊                year ▻ 1989                                                                                             ┊
┊              in_dir ▻ /g/data/rt52/era5/pressure-levels/reanalysis/t/1989/*                                            ┊
┊            out_file ▻ /g/data/wb00/admin/testing/nci_5.625/test_test/temperature_1989_5.625.nc                         ┊
└────────────────────────────────────────────────────────────────────────────────────────────────────────────────────────┘
<xarray.Dataset>
Dimensions:    (longitude: 1440, latitude: 721, level: 37, time: 8760)
Coordinates:
  * longitude  (longitude) float32 -180.0 -179.8 -179.5 ... 179.2 179.5 179.8
  * latitude   (latitude) float32 90.0 89.75 89.5 89.25 ... -89.5 -89.75 -90.0
  * level      (level) int32 1 2 3 5 7 10 20 30 ... 850 875 900 925 950 975 1000
  * time       (time) datetime64[ns] 1989-01-01 ... 1989-12-31T23:00:00
Data variables:
    t          (time, level, latitude, longitude) float32 dask.array<chunksize=(744, 37, 721, 1440), meta=np.ndarray>
Attributes:
    Conventions:  CF-1.6
    history:      2020-10-31 02:56:40 UTC+1100 by era5_replication_tools-1.2....
    license:      Licence to use Copernicus Products: https://apps.ecmwf.int/...
    summary:      ERA5 is the fifth generation ECMWF atmospheric reanalysis o...
    title:        ERA5 pressure-levels oper temperature 19890101-19890131
━━━━━━━━━━━━━━━━━━━━━━━━━━━━━━━━━━━━━━━━━━━━━━━━━━━━━━━━━━━━━━━━━━━━━━━━━━━━━━━━━━━━━━━━━━━━━━━━━━━━━━━━━━━━━━━━━━━━━━━━━━


┌────────────────────────────────────────────────────────────────────────────────────────────────────────────────────────┐
┊                                                Fri Mar 31 02:16:25 2023                                                ┊
┊                rank ▻ 11                                                                                               ┊
┊                node ▻ gadi-cpu-spr-0064.gadi.nci.org.au                                                                ┊
┊                year ▻ 1990                                                                                             ┊
┊              in_dir ▻ /g/data/rt52/era5/pressure-levels/reanalysis/t/1990/*                                            ┊
┊            out_file ▻ /g/data/wb00/admin/testing/nci_5.625/test_test/temperature_1990_5.625.nc                         ┊
└────────────────────────────────────────────────────────────────────────────────────────────────────────────────────────┘
<xarray.Dataset>
Dimensions:    (longitude: 1440, latitude: 721, level: 37, time: 8760)
Coordinates:
  * longitude  (longitude) float32 -180.0 -179.8 -179.5 ... 179.2 179.5 179.8
  * latitude   (latitude) float32 90.0 89.75 89.5 89.25 ... -89.5 -89.75 -90.0
  * level      (level) int32 1 2 3 5 7 10 20 30 ... 850 875 900 925 950 975 1000
  * time       (time) datetime64[ns] 1990-01-01 ... 1990-12-31T23:00:00
Data variables:
    t          (time, level, latitude, longitude) float32 dask.array<chunksize=(744, 37, 721, 1440), meta=np.ndarray>
Attributes:
    Conventions:  CF-1.6
    history:      2020-10-30 12:10:29 UTC+1100 by era5_replication_tools-1.2....
    license:      Licence to use Copernicus Products: https://apps.ecmwf.int/...
    summary:      ERA5 is the fifth generation ECMWF atmospheric reanalysis o...
    title:        ERA5 pressure-levels oper temperature 19900101-19900131
━━━━━━━━━━━━━━━━━━━━━━━━━━━━━━━━━━━━━━━━━━━━━━━━━━━━━━━━━━━━━━━━━━━━━━━━━━━━━━━━━━━━━━━━━━━━━━━━━━━━━━━━━━━━━━━━━━━━━━━━━━


┌────────────────────────────────────────────────────────────────────────────────────────────────────────────────────────┐
┊                                                Fri Mar 31 02:16:27 2023                                                ┊
┊                rank ▻ 12                                                                                               ┊
┊                node ▻ gadi-cpu-spr-0064.gadi.nci.org.au                                                                ┊
┊                year ▻ 1991                                                                                             ┊
┊              in_dir ▻ /g/data/rt52/era5/pressure-levels/reanalysis/t/1991/*                                            ┊
┊            out_file ▻ /g/data/wb00/admin/testing/nci_5.625/test_test/temperature_1991_5.625.nc                         ┊
└────────────────────────────────────────────────────────────────────────────────────────────────────────────────────────┘
<xarray.Dataset>
Dimensions:    (longitude: 1440, latitude: 721, level: 37, time: 8760)
Coordinates:
  * longitude  (longitude) float32 -180.0 -179.8 -179.5 ... 179.2 179.5 179.8
  * latitude   (latitude) float32 90.0 89.75 89.5 89.25 ... -89.5 -89.75 -90.0
  * level      (level) int32 1 2 3 5 7 10 20 30 ... 850 875 900 925 950 975 1000
  * time       (time) datetime64[ns] 1991-01-01 ... 1991-12-31T23:00:00
Data variables:
    t          (time, level, latitude, longitude) float32 dask.array<chunksize=(744, 37, 721, 1440), meta=np.ndarray>
Attributes:
    Conventions:  CF-1.6
    history:      2020-10-29 20:21:35 UTC+1100 by era5_replication_tools-1.2....
    license:      Licence to use Copernicus Products: https://apps.ecmwf.int/...
    summary:      ERA5 is the fifth generation ECMWF atmospheric reanalysis o...
    title:        ERA5 pressure-levels oper temperature 19910101-19910131
━━━━━━━━━━━━━━━━━━━━━━━━━━━━━━━━━━━━━━━━━━━━━━━━━━━━━━━━━━━━━━━━━━━━━━━━━━━━━━━━━━━━━━━━━━━━━━━━━━━━━━━━━━━━━━━━━━━━━━━━━━


┌────────────────────────────────────────────────────────────────────────────────────────────────────────────────────────┐
┊                                                Fri Mar 31 02:16:29 2023                                                ┊
┊                rank ▻ 13                                                                                               ┊
┊                node ▻ gadi-cpu-spr-0064.gadi.nci.org.au                                                                ┊
┊                year ▻ 1992                                                                                             ┊
┊              in_dir ▻ /g/data/rt52/era5/pressure-levels/reanalysis/t/1992/*                                            ┊
┊            out_file ▻ /g/data/wb00/admin/testing/nci_5.625/test_test/temperature_1992_5.625.nc                         ┊
└────────────────────────────────────────────────────────────────────────────────────────────────────────────────────────┘
<xarray.Dataset>
Dimensions:    (longitude: 1440, latitude: 721, level: 37, time: 8784)
Coordinates:
  * longitude  (longitude) float32 -180.0 -179.8 -179.5 ... 179.2 179.5 179.8
  * latitude   (latitude) float32 90.0 89.75 89.5 89.25 ... -89.5 -89.75 -90.0
  * level      (level) int32 1 2 3 5 7 10 20 30 ... 850 875 900 925 950 975 1000
  * time       (time) datetime64[ns] 1992-01-01 ... 1992-12-31T23:00:00
Data variables:
    t          (time, level, latitude, longitude) float32 dask.array<chunksize=(744, 37, 721, 1440), meta=np.ndarray>
Attributes:
    Conventions:  CF-1.6
    history:      2020-10-29 05:10:26 UTC+1100 by era5_replication_tools-1.2....
    license:      Licence to use Copernicus Products: https://apps.ecmwf.int/...
    summary:      ERA5 is the fifth generation ECMWF atmospheric reanalysis o...
    title:        ERA5 pressure-levels oper temperature 19920101-19920131
━━━━━━━━━━━━━━━━━━━━━━━━━━━━━━━━━━━━━━━━━━━━━━━━━━━━━━━━━━━━━━━━━━━━━━━━━━━━━━━━━━━━━━━━━━━━━━━━━━━━━━━━━━━━━━━━━━━━━━━━━━


┌────────────────────────────────────────────────────────────────────────────────────────────────────────────────────────┐
┊                                                Fri Mar 31 02:16:31 2023                                                ┊
┊                rank ▻ 14                                                                                               ┊
┊                node ▻ gadi-cpu-spr-0064.gadi.nci.org.au                                                                ┊
┊                year ▻ 1993                                                                                             ┊
┊              in_dir ▻ /g/data/rt52/era5/pressure-levels/reanalysis/t/1993/*                                            ┊
┊            out_file ▻ /g/data/wb00/admin/testing/nci_5.625/test_test/temperature_1993_5.625.nc                         ┊
└────────────────────────────────────────────────────────────────────────────────────────────────────────────────────────┘
<xarray.Dataset>
Dimensions:    (longitude: 1440, latitude: 721, level: 37, time: 8760)
Coordinates:
  * longitude  (longitude) float32 -180.0 -179.8 -179.5 ... 179.2 179.5 179.8
  * latitude   (latitude) float32 90.0 89.75 89.5 89.25 ... -89.5 -89.75 -90.0
  * level      (level) int32 1 2 3 5 7 10 20 30 ... 850 875 900 925 950 975 1000
  * time       (time) datetime64[ns] 1993-01-01 ... 1993-12-31T23:00:00
Data variables:
    t          (time, level, latitude, longitude) float32 dask.array<chunksize=(744, 37, 721, 1440), meta=np.ndarray>
Attributes:
    Conventions:  CF-1.6
    history:      2020-10-28 17:11:58 UTC+1100 by era5_replication_tools-1.2....
    license:      Licence to use Copernicus Products: https://apps.ecmwf.int/...
    summary:      ERA5 is the fifth generation ECMWF atmospheric reanalysis o...
    title:        ERA5 pressure-levels oper temperature 19930101-19930131
━━━━━━━━━━━━━━━━━━━━━━━━━━━━━━━━━━━━━━━━━━━━━━━━━━━━━━━━━━━━━━━━━━━━━━━━━━━━━━━━━━━━━━━━━━━━━━━━━━━━━━━━━━━━━━━━━━━━━━━━━━


┌────────────────────────────────────────────────────────────────────────────────────────────────────────────────────────┐
┊                                                Fri Mar 31 02:16:33 2023                                                ┊
┊                rank ▻ 15                                                                                               ┊
┊                node ▻ gadi-cpu-spr-0064.gadi.nci.org.au                                                                ┊
┊                year ▻ 1994                                                                                             ┊
┊              in_dir ▻ /g/data/rt52/era5/pressure-levels/reanalysis/t/1994/*                                            ┊
┊            out_file ▻ /g/data/wb00/admin/testing/nci_5.625/test_test/temperature_1994_5.625.nc                         ┊
└────────────────────────────────────────────────────────────────────────────────────────────────────────────────────────┘
<xarray.Dataset>
Dimensions:    (longitude: 1440, latitude: 721, level: 37, time: 8760)
Coordinates:
  * longitude  (longitude) float32 -180.0 -179.8 -179.5 ... 179.2 179.5 179.8
  * latitude   (latitude) float32 90.0 89.75 89.5 89.25 ... -89.5 -89.75 -90.0
  * level      (level) int32 1 2 3 5 7 10 20 30 ... 850 875 900 925 950 975 1000
  * time       (time) datetime64[ns] 1994-01-01 ... 1994-12-31T23:00:00
Data variables:
    t          (time, level, latitude, longitude) float32 dask.array<chunksize=(744, 37, 721, 1440), meta=np.ndarray>
Attributes:
    Conventions:  CF-1.6
    history:      2020-10-28 01:17:09 UTC+1100 by era5_replication_tools-1.2....
    license:      Licence to use Copernicus Products: https://apps.ecmwf.int/...
    summary:      ERA5 is the fifth generation ECMWF atmospheric reanalysis o...
    title:        ERA5 pressure-levels oper temperature 19940101-19940131
━━━━━━━━━━━━━━━━━━━━━━━━━━━━━━━━━━━━━━━━━━━━━━━━━━━━━━━━━━━━━━━━━━━━━━━━━━━━━━━━━━━━━━━━━━━━━━━━━━━━━━━━━━━━━━━━━━━━━━━━━━


┌────────────────────────────────────────────────────────────────────────────────────────────────────────────────────────┐
┊                                                Fri Mar 31 02:16:35 2023                                                ┊
┊                rank ▻ 16                                                                                               ┊
┊                node ▻ gadi-cpu-spr-0064.gadi.nci.org.au                                                                ┊
┊                year ▻ 1995                                                                                             ┊
┊              in_dir ▻ /g/data/rt52/era5/pressure-levels/reanalysis/t/1995/*                                            ┊
┊            out_file ▻ /g/data/wb00/admin/testing/nci_5.625/test_test/temperature_1995_5.625.nc                         ┊
└────────────────────────────────────────────────────────────────────────────────────────────────────────────────────────┘
<xarray.Dataset>
Dimensions:    (longitude: 1440, latitude: 721, level: 37, time: 8760)
Coordinates:
  * longitude  (longitude) float32 -180.0 -179.8 -179.5 ... 179.2 179.5 179.8
  * latitude   (latitude) float32 90.0 89.75 89.5 89.25 ... -89.5 -89.75 -90.0
  * level      (level) int32 1 2 3 5 7 10 20 30 ... 850 875 900 925 950 975 1000
  * time       (time) datetime64[ns] 1995-01-01 ... 1995-12-31T23:00:00
Data variables:
    t          (time, level, latitude, longitude) float32 dask.array<chunksize=(744, 37, 721, 1440), meta=np.ndarray>
Attributes:
    Conventions:  CF-1.6
    history:      2020-10-27 07:51:22 UTC+1100 by era5_replication_tools-1.2....
    license:      Licence to use Copernicus Products: https://apps.ecmwf.int/...
    summary:      ERA5 is the fifth generation ECMWF atmospheric reanalysis o...
    title:        ERA5 pressure-levels oper temperature 19950101-19950131
━━━━━━━━━━━━━━━━━━━━━━━━━━━━━━━━━━━━━━━━━━━━━━━━━━━━━━━━━━━━━━━━━━━━━━━━━━━━━━━━━━━━━━━━━━━━━━━━━━━━━━━━━━━━━━━━━━━━━━━━━━


┌────────────────────────────────────────────────────────────────────────────────────────────────────────────────────────┐
┊                                                Fri Mar 31 02:16:37 2023                                                ┊
┊                rank ▻ 17                                                                                               ┊
┊                node ▻ gadi-cpu-spr-0064.gadi.nci.org.au                                                                ┊
┊                year ▻ 1996                                                                                             ┊
┊              in_dir ▻ /g/data/rt52/era5/pressure-levels/reanalysis/t/1996/*                                            ┊
┊            out_file ▻ /g/data/wb00/admin/testing/nci_5.625/test_test/temperature_1996_5.625.nc                         ┊
└────────────────────────────────────────────────────────────────────────────────────────────────────────────────────────┘
<xarray.Dataset>
Dimensions:    (longitude: 1440, latitude: 721, level: 37, time: 8784)
Coordinates:
  * longitude  (longitude) float32 -180.0 -179.8 -179.5 ... 179.2 179.5 179.8
  * latitude   (latitude) float32 90.0 89.75 89.5 89.25 ... -89.5 -89.75 -90.0
  * level      (level) int32 1 2 3 5 7 10 20 30 ... 850 875 900 925 950 975 1000
  * time       (time) datetime64[ns] 1996-01-01 ... 1996-12-31T23:00:00
Data variables:
    t          (time, level, latitude, longitude) float32 dask.array<chunksize=(744, 37, 721, 1440), meta=np.ndarray>
Attributes:
    Conventions:  CF-1.6
    history:      2021-08-26 22:59:41 UTC+1000 by era5_replication_tools-1.9....
    license:      Licence to use Copernicus Products: https://apps.ecmwf.int/...
    summary:      ERA5 is the fifth generation ECMWF atmospheric reanalysis o...
    title:        ERA5 pressure-levels oper temperature 19960101-19960131
━━━━━━━━━━━━━━━━━━━━━━━━━━━━━━━━━━━━━━━━━━━━━━━━━━━━━━━━━━━━━━━━━━━━━━━━━━━━━━━━━━━━━━━━━━━━━━━━━━━━━━━━━━━━━━━━━━━━━━━━━━


┌────────────────────────────────────────────────────────────────────────────────────────────────────────────────────────┐
┊                                                Fri Mar 31 02:16:39 2023                                                ┊
┊                rank ▻ 18                                                                                               ┊
┊                node ▻ gadi-cpu-spr-0064.gadi.nci.org.au                                                                ┊
┊                year ▻ 1997                                                                                             ┊
┊              in_dir ▻ /g/data/rt52/era5/pressure-levels/reanalysis/t/1997/*                                            ┊
┊            out_file ▻ /g/data/wb00/admin/testing/nci_5.625/test_test/temperature_1997_5.625.nc                         ┊
└────────────────────────────────────────────────────────────────────────────────────────────────────────────────────────┘
<xarray.Dataset>
Dimensions:    (longitude: 1440, latitude: 721, level: 37, time: 8760)
Coordinates:
  * longitude  (longitude) float32 -180.0 -179.8 -179.5 ... 179.2 179.5 179.8
  * latitude   (latitude) float32 90.0 89.75 89.5 89.25 ... -89.5 -89.75 -90.0
  * level      (level) int32 1 2 3 5 7 10 20 30 ... 850 875 900 925 950 975 1000
  * time       (time) datetime64[ns] 1997-01-01 ... 1997-12-31T23:00:00
Data variables:
    t          (time, level, latitude, longitude) float32 dask.array<chunksize=(744, 37, 721, 1440), meta=np.ndarray>
Attributes:
    Conventions:  CF-1.6
    history:      2020-10-25 01:54:23 UTC+1100 by era5_replication_tools-1.2....
    license:      Licence to use Copernicus Products: https://apps.ecmwf.int/...
    summary:      ERA5 is the fifth generation ECMWF atmospheric reanalysis o...
    title:        ERA5 pressure-levels oper temperature 19970101-19970131
━━━━━━━━━━━━━━━━━━━━━━━━━━━━━━━━━━━━━━━━━━━━━━━━━━━━━━━━━━━━━━━━━━━━━━━━━━━━━━━━━━━━━━━━━━━━━━━━━━━━━━━━━━━━━━━━━━━━━━━━━━


┌────────────────────────────────────────────────────────────────────────────────────────────────────────────────────────┐
┊                                                Fri Mar 31 02:16:41 2023                                                ┊
┊                rank ▻ 19                                                                                               ┊
┊                node ▻ gadi-cpu-spr-0064.gadi.nci.org.au                                                                ┊
┊                year ▻ 1998                                                                                             ┊
┊              in_dir ▻ /g/data/rt52/era5/pressure-levels/reanalysis/t/1998/*                                            ┊
┊            out_file ▻ /g/data/wb00/admin/testing/nci_5.625/test_test/temperature_1998_5.625.nc                         ┊
└────────────────────────────────────────────────────────────────────────────────────────────────────────────────────────┘
<xarray.Dataset>
Dimensions:    (longitude: 1440, latitude: 721, level: 37, time: 8760)
Coordinates:
  * longitude  (longitude) float32 -180.0 -179.8 -179.5 ... 179.2 179.5 179.8
  * latitude   (latitude) float32 90.0 89.75 89.5 89.25 ... -89.5 -89.75 -90.0
  * level      (level) int32 1 2 3 5 7 10 20 30 ... 850 875 900 925 950 975 1000
  * time       (time) datetime64[ns] 1998-01-01 ... 1998-12-31T23:00:00
Data variables:
    t          (time, level, latitude, longitude) float32 dask.array<chunksize=(744, 37, 721, 1440), meta=np.ndarray>
Attributes:
    Conventions:  CF-1.6
    history:      2020-10-24 08:42:38 UTC+1100 by era5_replication_tools-1.2....
    license:      Licence to use Copernicus Products: https://apps.ecmwf.int/...
    summary:      ERA5 is the fifth generation ECMWF atmospheric reanalysis o...
    title:        ERA5 pressure-levels oper temperature 19980101-19980131
━━━━━━━━━━━━━━━━━━━━━━━━━━━━━━━━━━━━━━━━━━━━━━━━━━━━━━━━━━━━━━━━━━━━━━━━━━━━━━━━━━━━━━━━━━━━━━━━━━━━━━━━━━━━━━━━━━━━━━━━━━


┌────────────────────────────────────────────────────────────────────────────────────────────────────────────────────────┐
┊                                                Fri Mar 31 02:16:43 2023                                                ┊
┊                rank ▻ 20                                                                                               ┊
┊                node ▻ gadi-cpu-spr-0065.gadi.nci.org.au                                                                ┊
┊                year ▻ 1999                                                                                             ┊
┊              in_dir ▻ /g/data/rt52/era5/pressure-levels/reanalysis/t/1999/*                                            ┊
┊            out_file ▻ /g/data/wb00/admin/testing/nci_5.625/test_test/temperature_1999_5.625.nc                         ┊
└────────────────────────────────────────────────────────────────────────────────────────────────────────────────────────┘
<xarray.Dataset>
Dimensions:    (longitude: 1440, latitude: 721, level: 37, time: 8760)
Coordinates:
  * longitude  (longitude) float32 -180.0 -179.8 -179.5 ... 179.2 179.5 179.8
  * latitude   (latitude) float32 90.0 89.75 89.5 89.25 ... -89.5 -89.75 -90.0
  * level      (level) int32 1 2 3 5 7 10 20 30 ... 850 875 900 925 950 975 1000
  * time       (time) datetime64[ns] 1999-01-01 ... 1999-12-31T23:00:00
Data variables:
    t          (time, level, latitude, longitude) float32 dask.array<chunksize=(744, 37, 721, 1440), meta=np.ndarray>
Attributes:
    Conventions:  CF-1.6
    history:      2020-10-23 15:19:08 UTC+1100 by era5_replication_tools-1.2....
    license:      Licence to use Copernicus Products: https://apps.ecmwf.int/...
    summary:      ERA5 is the fifth generation ECMWF atmospheric reanalysis o...
    title:        ERA5 pressure-levels oper temperature 19990101-19990131
━━━━━━━━━━━━━━━━━━━━━━━━━━━━━━━━━━━━━━━━━━━━━━━━━━━━━━━━━━━━━━━━━━━━━━━━━━━━━━━━━━━━━━━━━━━━━━━━━━━━━━━━━━━━━━━━━━━━━━━━━━


┌────────────────────────────────────────────────────────────────────────────────────────────────────────────────────────┐
┊                                                Fri Mar 31 02:16:45 2023                                                ┊
┊                rank ▻ 21                                                                                               ┊
┊                node ▻ gadi-cpu-spr-0065.gadi.nci.org.au                                                                ┊
┊                year ▻ 2000                                                                                             ┊
┊              in_dir ▻ /g/data/rt52/era5/pressure-levels/reanalysis/t/2000/*                                            ┊
┊            out_file ▻ /g/data/wb00/admin/testing/nci_5.625/test_test/temperature_2000_5.625.nc                         ┊
└────────────────────────────────────────────────────────────────────────────────────────────────────────────────────────┘
<xarray.Dataset>
Dimensions:    (longitude: 1440, latitude: 721, level: 37, time: 8784)
Coordinates:
  * longitude  (longitude) float32 -180.0 -179.8 -179.5 ... 179.2 179.5 179.8
  * latitude   (latitude) float32 90.0 89.75 89.5 89.25 ... -89.5 -89.75 -90.0
  * level      (level) int32 1 2 3 5 7 10 20 30 ... 850 875 900 925 950 975 1000
  * time       (time) datetime64[ns] 2000-01-01 ... 2000-12-31T23:00:00
Data variables:
    t          (time, level, latitude, longitude) float32 dask.array<chunksize=(744, 37, 721, 1440), meta=np.ndarray>
Attributes:
    Conventions:  CF-1.6
    license:      Licence to use Copernicus Products: https://apps.ecmwf.int/...
    summary:      ERA5 is the fifth generation ECMWF atmospheric reanalysis o...
    title:        ERA5 pressure-levels oper temperature 20000101-20000131
    history:      2021-01-08 07:37:20 UTC+1100 by era5_replication_tools-1.8....
━━━━━━━━━━━━━━━━━━━━━━━━━━━━━━━━━━━━━━━━━━━━━━━━━━━━━━━━━━━━━━━━━━━━━━━━━━━━━━━━━━━━━━━━━━━━━━━━━━━━━━━━━━━━━━━━━━━━━━━━━━


┌────────────────────────────────────────────────────────────────────────────────────────────────────────────────────────┐
┊                                                Fri Mar 31 02:16:47 2023                                                ┊
┊                rank ▻ 22                                                                                               ┊
┊                node ▻ gadi-cpu-spr-0065.gadi.nci.org.au                                                                ┊
┊                year ▻ 2001                                                                                             ┊
┊              in_dir ▻ /g/data/rt52/era5/pressure-levels/reanalysis/t/2001/*                                            ┊
┊            out_file ▻ /g/data/wb00/admin/testing/nci_5.625/test_test/temperature_2001_5.625.nc                         ┊
└────────────────────────────────────────────────────────────────────────────────────────────────────────────────────────┘
<xarray.Dataset>
Dimensions:    (longitude: 1440, latitude: 721, level: 37, time: 8760)
Coordinates:
  * longitude  (longitude) float32 -180.0 -179.8 -179.5 ... 179.2 179.5 179.8
  * latitude   (latitude) float32 90.0 89.75 89.5 89.25 ... -89.5 -89.75 -90.0
  * level      (level) int32 1 2 3 5 7 10 20 30 ... 850 875 900 925 950 975 1000
  * time       (time) datetime64[ns] 2001-01-01 ... 2001-12-31T23:00:00
Data variables:
    t          (time, level, latitude, longitude) float32 dask.array<chunksize=(744, 37, 721, 1440), meta=np.ndarray>
Attributes:
    Conventions:  CF-1.6
    license:      Licence to use Copernicus Products: https://apps.ecmwf.int/...
    summary:      ERA5 is the fifth generation ECMWF atmospheric reanalysis o...
    title:        ERA5 pressure-levels oper temperature 20010101-20010131
    history:      2021-01-08 07:37:32 UTC+1100 by era5_replication_tools-1.8....
━━━━━━━━━━━━━━━━━━━━━━━━━━━━━━━━━━━━━━━━━━━━━━━━━━━━━━━━━━━━━━━━━━━━━━━━━━━━━━━━━━━━━━━━━━━━━━━━━━━━━━━━━━━━━━━━━━━━━━━━━━


┌────────────────────────────────────────────────────────────────────────────────────────────────────────────────────────┐
┊                                                Fri Mar 31 02:16:49 2023                                                ┊
┊                rank ▻ 23                                                                                               ┊
┊                node ▻ gadi-cpu-spr-0065.gadi.nci.org.au                                                                ┊
┊                year ▻ 2002                                                                                             ┊
┊              in_dir ▻ /g/data/rt52/era5/pressure-levels/reanalysis/t/2002/*                                            ┊
┊            out_file ▻ /g/data/wb00/admin/testing/nci_5.625/test_test/temperature_2002_5.625.nc                         ┊
└────────────────────────────────────────────────────────────────────────────────────────────────────────────────────────┘
<xarray.Dataset>
Dimensions:    (longitude: 1440, latitude: 721, level: 37, time: 8760)
Coordinates:
  * longitude  (longitude) float32 -180.0 -179.8 -179.5 ... 179.2 179.5 179.8
  * latitude   (latitude) float32 90.0 89.75 89.5 89.25 ... -89.5 -89.75 -90.0
  * level      (level) int32 1 2 3 5 7 10 20 30 ... 850 875 900 925 950 975 1000
  * time       (time) datetime64[ns] 2002-01-01 ... 2002-12-31T23:00:00
Data variables:
    t          (time, level, latitude, longitude) float32 dask.array<chunksize=(744, 37, 721, 1440), meta=np.ndarray>
Attributes:
    Conventions:  CF-1.6
    history:      2020-11-10 22:43:35 UTC+1100 by era5_replication_tools-1.2....
    license:      Licence to use Copernicus Products: https://apps.ecmwf.int/...
    summary:      ERA5 is the fifth generation ECMWF atmospheric reanalysis o...
    title:        ERA5 pressure-levels oper temperature 20020101-20020131
━━━━━━━━━━━━━━━━━━━━━━━━━━━━━━━━━━━━━━━━━━━━━━━━━━━━━━━━━━━━━━━━━━━━━━━━━━━━━━━━━━━━━━━━━━━━━━━━━━━━━━━━━━━━━━━━━━━━━━━━━━


┌────────────────────────────────────────────────────────────────────────────────────────────────────────────────────────┐
┊                                                Fri Mar 31 02:16:51 2023                                                ┊
┊                rank ▻ 24                                                                                               ┊
┊                node ▻ gadi-cpu-spr-0065.gadi.nci.org.au                                                                ┊
┊                year ▻ 2003                                                                                             ┊
┊              in_dir ▻ /g/data/rt52/era5/pressure-levels/reanalysis/t/2003/*                                            ┊
┊            out_file ▻ /g/data/wb00/admin/testing/nci_5.625/test_test/temperature_2003_5.625.nc                         ┊
└────────────────────────────────────────────────────────────────────────────────────────────────────────────────────────┘
<xarray.Dataset>
Dimensions:    (longitude: 1440, latitude: 721, level: 37, time: 8760)
Coordinates:
  * longitude  (longitude) float32 -180.0 -179.8 -179.5 ... 179.2 179.5 179.8
  * latitude   (latitude) float32 90.0 89.75 89.5 89.25 ... -89.5 -89.75 -90.0
  * level      (level) int32 1 2 3 5 7 10 20 30 ... 850 875 900 925 950 975 1000
  * time       (time) datetime64[ns] 2003-01-01 ... 2003-12-31T23:00:00
Data variables:
    t          (time, level, latitude, longitude) float32 dask.array<chunksize=(744, 37, 721, 1440), meta=np.ndarray>
Attributes:
    Conventions:  CF-1.6
    license:      Licence to use Copernicus Products: https://apps.ecmwf.int/...
    summary:      ERA5 is the fifth generation ECMWF atmospheric reanalysis o...
    title:        ERA5 pressure-levels oper temperature 20030101-20030131
    history:      2021-01-08 07:37:39 UTC+1100 by era5_replication_tools-1.8....
━━━━━━━━━━━━━━━━━━━━━━━━━━━━━━━━━━━━━━━━━━━━━━━━━━━━━━━━━━━━━━━━━━━━━━━━━━━━━━━━━━━━━━━━━━━━━━━━━━━━━━━━━━━━━━━━━━━━━━━━━━


┌────────────────────────────────────────────────────────────────────────────────────────────────────────────────────────┐
┊                                                Fri Mar 31 02:16:53 2023                                                ┊
┊                rank ▻ 25                                                                                               ┊
┊                node ▻ gadi-cpu-spr-0065.gadi.nci.org.au                                                                ┊
┊                year ▻ 2004                                                                                             ┊
┊              in_dir ▻ /g/data/rt52/era5/pressure-levels/reanalysis/t/2004/*                                            ┊
┊            out_file ▻ /g/data/wb00/admin/testing/nci_5.625/test_test/temperature_2004_5.625.nc                         ┊
└────────────────────────────────────────────────────────────────────────────────────────────────────────────────────────┘
<xarray.Dataset>
Dimensions:    (longitude: 1440, latitude: 721, level: 37, time: 8784)
Coordinates:
  * longitude  (longitude) float32 -180.0 -179.8 -179.5 ... 179.2 179.5 179.8
  * latitude   (latitude) float32 90.0 89.75 89.5 89.25 ... -89.5 -89.75 -90.0
  * level      (level) int32 1 2 3 5 7 10 20 30 ... 850 875 900 925 950 975 1000
  * time       (time) datetime64[ns] 2004-01-01 ... 2004-12-31T23:00:00
Data variables:
    t          (time, level, latitude, longitude) float32 dask.array<chunksize=(744, 37, 721, 1440), meta=np.ndarray>
Attributes:
    Conventions:  CF-1.6
    license:      Licence to use Copernicus Products: https://apps.ecmwf.int/...
    summary:      ERA5 is the fifth generation ECMWF atmospheric reanalysis o...
    title:        ERA5 pressure-levels oper temperature 20040101-20040131
    history:      2021-01-08 07:37:47 UTC+1100 by era5_replication_tools-1.8....
━━━━━━━━━━━━━━━━━━━━━━━━━━━━━━━━━━━━━━━━━━━━━━━━━━━━━━━━━━━━━━━━━━━━━━━━━━━━━━━━━━━━━━━━━━━━━━━━━━━━━━━━━━━━━━━━━━━━━━━━━━


┌────────────────────────────────────────────────────────────────────────────────────────────────────────────────────────┐
┊                                                Fri Mar 31 02:16:55 2023                                                ┊
┊                rank ▻ 26                                                                                               ┊
┊                node ▻ gadi-cpu-spr-0065.gadi.nci.org.au                                                                ┊
┊                year ▻ 2005                                                                                             ┊
┊              in_dir ▻ /g/data/rt52/era5/pressure-levels/reanalysis/t/2005/*                                            ┊
┊            out_file ▻ /g/data/wb00/admin/testing/nci_5.625/test_test/temperature_2005_5.625.nc                         ┊
└────────────────────────────────────────────────────────────────────────────────────────────────────────────────────────┘
<xarray.Dataset>
Dimensions:    (longitude: 1440, latitude: 721, level: 37, time: 8760)
Coordinates:
  * longitude  (longitude) float32 -180.0 -179.8 -179.5 ... 179.2 179.5 179.8
  * latitude   (latitude) float32 90.0 89.75 89.5 89.25 ... -89.5 -89.75 -90.0
  * level      (level) int32 1 2 3 5 7 10 20 30 ... 850 875 900 925 950 975 1000
  * time       (time) datetime64[ns] 2005-01-01 ... 2005-12-31T23:00:00
Data variables:
    t          (time, level, latitude, longitude) float32 dask.array<chunksize=(744, 37, 721, 1440), meta=np.ndarray>
Attributes:
    Conventions:  CF-1.6
    history:      2020-11-08 19:03:04 UTC+1100 by era5_replication_tools-1.2....
    license:      Licence to use Copernicus Products: https://apps.ecmwf.int/...
    summary:      ERA5 is the fifth generation ECMWF atmospheric reanalysis o...
    title:        ERA5 pressure-levels oper temperature 20050101-20050131
━━━━━━━━━━━━━━━━━━━━━━━━━━━━━━━━━━━━━━━━━━━━━━━━━━━━━━━━━━━━━━━━━━━━━━━━━━━━━━━━━━━━━━━━━━━━━━━━━━━━━━━━━━━━━━━━━━━━━━━━━━


┌────────────────────────────────────────────────────────────────────────────────────────────────────────────────────────┐
┊                                                Fri Mar 31 02:16:57 2023                                                ┊
┊                rank ▻ 27                                                                                               ┊
┊                node ▻ gadi-cpu-spr-0065.gadi.nci.org.au                                                                ┊
┊                year ▻ 2006                                                                                             ┊
┊              in_dir ▻ /g/data/rt52/era5/pressure-levels/reanalysis/t/2006/*                                            ┊
┊            out_file ▻ /g/data/wb00/admin/testing/nci_5.625/test_test/temperature_2006_5.625.nc                         ┊
└────────────────────────────────────────────────────────────────────────────────────────────────────────────────────────┘
<xarray.Dataset>
Dimensions:    (longitude: 1440, latitude: 721, level: 37, time: 8760)
Coordinates:
  * longitude  (longitude) float32 -180.0 -179.8 -179.5 ... 179.2 179.5 179.8
  * latitude   (latitude) float32 90.0 89.75 89.5 89.25 ... -89.5 -89.75 -90.0
  * level      (level) int32 1 2 3 5 7 10 20 30 ... 850 875 900 925 950 975 1000
  * time       (time) datetime64[ns] 2006-01-01 ... 2006-12-31T23:00:00
Data variables:
    t          (time, level, latitude, longitude) float32 dask.array<chunksize=(744, 37, 721, 1440), meta=np.ndarray>
Attributes:
    Conventions:  CF-1.6
    history:      2020-11-08 02:43:11 UTC+1100 by era5_replication_tools-1.2....
    license:      Licence to use Copernicus Products: https://apps.ecmwf.int/...
    summary:      ERA5 is the fifth generation ECMWF atmospheric reanalysis o...
    title:        ERA5 pressure-levels oper temperature 20060101-20060131
━━━━━━━━━━━━━━━━━━━━━━━━━━━━━━━━━━━━━━━━━━━━━━━━━━━━━━━━━━━━━━━━━━━━━━━━━━━━━━━━━━━━━━━━━━━━━━━━━━━━━━━━━━━━━━━━━━━━━━━━━━


┌────────────────────────────────────────────────────────────────────────────────────────────────────────────────────────┐
┊                                                Fri Mar 31 02:16:59 2023                                                ┊
┊                rank ▻ 28                                                                                               ┊
┊                node ▻ gadi-cpu-spr-0065.gadi.nci.org.au                                                                ┊
┊                year ▻ 2007                                                                                             ┊
┊              in_dir ▻ /g/data/rt52/era5/pressure-levels/reanalysis/t/2007/*                                            ┊
┊            out_file ▻ /g/data/wb00/admin/testing/nci_5.625/test_test/temperature_2007_5.625.nc                         ┊
└────────────────────────────────────────────────────────────────────────────────────────────────────────────────────────┘
<xarray.Dataset>
Dimensions:    (longitude: 1440, latitude: 721, level: 37, time: 8760)
Coordinates:
  * longitude  (longitude) float32 -180.0 -179.8 -179.5 ... 179.2 179.5 179.8
  * latitude   (latitude) float32 90.0 89.75 89.5 89.25 ... -89.5 -89.75 -90.0
  * level      (level) int32 1 2 3 5 7 10 20 30 ... 850 875 900 925 950 975 1000
  * time       (time) datetime64[ns] 2007-01-01 ... 2007-12-31T23:00:00
Data variables:
    t          (time, level, latitude, longitude) float32 dask.array<chunksize=(744, 37, 721, 1440), meta=np.ndarray>
Attributes:
    Conventions:  CF-1.6
    history:      2020-10-22 21:53:16 UTC+1100 by era5_replication_tools-1.2....
    license:      Licence to use Copernicus Products: https://apps.ecmwf.int/...
    summary:      ERA5 is the fifth generation ECMWF atmospheric reanalysis o...
    title:        ERA5 pressure-levels oper temperature 20070101-20070131
━━━━━━━━━━━━━━━━━━━━━━━━━━━━━━━━━━━━━━━━━━━━━━━━━━━━━━━━━━━━━━━━━━━━━━━━━━━━━━━━━━━━━━━━━━━━━━━━━━━━━━━━━━━━━━━━━━━━━━━━━━


┌────────────────────────────────────────────────────────────────────────────────────────────────────────────────────────┐
┊                                                Fri Mar 31 02:17:01 2023                                                ┊
┊                rank ▻ 29                                                                                               ┊
┊                node ▻ gadi-cpu-spr-0065.gadi.nci.org.au                                                                ┊
┊                year ▻ 2008                                                                                             ┊
┊              in_dir ▻ /g/data/rt52/era5/pressure-levels/reanalysis/t/2008/*                                            ┊
┊            out_file ▻ /g/data/wb00/admin/testing/nci_5.625/test_test/temperature_2008_5.625.nc                         ┊
└────────────────────────────────────────────────────────────────────────────────────────────────────────────────────────┘
<xarray.Dataset>
Dimensions:    (longitude: 1440, latitude: 721, level: 37, time: 8784)
Coordinates:
  * longitude  (longitude) float32 -180.0 -179.8 -179.5 ... 179.2 179.5 179.8
  * latitude   (latitude) float32 90.0 89.75 89.5 89.25 ... -89.5 -89.75 -90.0
  * level      (level) int32 1 2 3 5 7 10 20 30 ... 850 875 900 925 950 975 1000
  * time       (time) datetime64[ns] 2008-01-01 ... 2008-12-31T23:00:00
Data variables:
    t          (time, level, latitude, longitude) float32 dask.array<chunksize=(744, 37, 721, 1440), meta=np.ndarray>
Attributes:
    Conventions:  CF-1.6
    history:      2020-11-25 21:00:16 UTC+1100 by era5_replication_tools-1.8....
    license:      Licence to use Copernicus Products: https://apps.ecmwf.int/...
    summary:      ERA5 is the fifth generation ECMWF atmospheric reanalysis o...
    title:        ERA5 pressure-levels oper temperature 20080101-20080131
━━━━━━━━━━━━━━━━━━━━━━━━━━━━━━━━━━━━━━━━━━━━━━━━━━━━━━━━━━━━━━━━━━━━━━━━━━━━━━━━━━━━━━━━━━━━━━━━━━━━━━━━━━━━━━━━━━━━━━━━━━


┌────────────────────────────────────────────────────────────────────────────────────────────────────────────────────────┐
┊                                                Fri Mar 31 02:17:03 2023                                                ┊
┊                rank ▻ 30                                                                                               ┊
┊                node ▻ gadi-cpu-spr-0067.gadi.nci.org.au                                                                ┊
┊                year ▻ 2009                                                                                             ┊
┊              in_dir ▻ /g/data/rt52/era5/pressure-levels/reanalysis/t/2009/*                                            ┊
┊            out_file ▻ /g/data/wb00/admin/testing/nci_5.625/test_test/temperature_2009_5.625.nc                         ┊
└────────────────────────────────────────────────────────────────────────────────────────────────────────────────────────┘
<xarray.Dataset>
Dimensions:    (longitude: 1440, latitude: 721, level: 37, time: 8760)
Coordinates:
  * longitude  (longitude) float32 -180.0 -179.8 -179.5 ... 179.2 179.5 179.8
  * latitude   (latitude) float32 90.0 89.75 89.5 89.25 ... -89.5 -89.75 -90.0
  * level      (level) int32 1 2 3 5 7 10 20 30 ... 850 875 900 925 950 975 1000
  * time       (time) datetime64[ns] 2009-01-01 ... 2009-12-31T23:00:00
Data variables:
    t          (time, level, latitude, longitude) float32 dask.array<chunksize=(744, 37, 721, 1440), meta=np.ndarray>
Attributes:
    Conventions:  CF-1.6
    history:      2020-11-25 07:51:38 UTC+1100 by era5_replication_tools-1.8....
    license:      Licence to use Copernicus Products: https://apps.ecmwf.int/...
    summary:      ERA5 is the fifth generation ECMWF atmospheric reanalysis o...
    title:        ERA5 pressure-levels oper temperature 20090101-20090131
━━━━━━━━━━━━━━━━━━━━━━━━━━━━━━━━━━━━━━━━━━━━━━━━━━━━━━━━━━━━━━━━━━━━━━━━━━━━━━━━━━━━━━━━━━━━━━━━━━━━━━━━━━━━━━━━━━━━━━━━━━


┌────────────────────────────────────────────────────────────────────────────────────────────────────────────────────────┐
┊                                                Fri Mar 31 02:17:05 2023                                                ┊
┊                rank ▻ 31                                                                                               ┊
┊                node ▻ gadi-cpu-spr-0067.gadi.nci.org.au                                                                ┊
┊                year ▻ 2010                                                                                             ┊
┊              in_dir ▻ /g/data/rt52/era5/pressure-levels/reanalysis/t/2010/*                                            ┊
┊            out_file ▻ /g/data/wb00/admin/testing/nci_5.625/test_test/temperature_2010_5.625.nc                         ┊
└────────────────────────────────────────────────────────────────────────────────────────────────────────────────────────┘
<xarray.Dataset>
Dimensions:    (longitude: 1440, latitude: 721, level: 37, time: 8760)
Coordinates:
  * longitude  (longitude) float32 -180.0 -179.8 -179.5 ... 179.2 179.5 179.8
  * latitude   (latitude) float32 90.0 89.75 89.5 89.25 ... -89.5 -89.75 -90.0
  * level      (level) int32 1 2 3 5 7 10 20 30 ... 850 875 900 925 950 975 1000
  * time       (time) datetime64[ns] 2010-01-01 ... 2010-12-31T23:00:00
Data variables:
    t          (time, level, latitude, longitude) float32 dask.array<chunksize=(744, 37, 721, 1440), meta=np.ndarray>
Attributes:
    Conventions:  CF-1.6
    history:      2020-11-24 19:53:13 UTC+1100 by era5_replication_tools-1.8....
    license:      Licence to use Copernicus Products: https://apps.ecmwf.int/...
    summary:      ERA5 is the fifth generation ECMWF atmospheric reanalysis o...
    title:        ERA5 pressure-levels oper temperature 20100101-20100131
━━━━━━━━━━━━━━━━━━━━━━━━━━━━━━━━━━━━━━━━━━━━━━━━━━━━━━━━━━━━━━━━━━━━━━━━━━━━━━━━━━━━━━━━━━━━━━━━━━━━━━━━━━━━━━━━━━━━━━━━━━


┌────────────────────────────────────────────────────────────────────────────────────────────────────────────────────────┐
┊                                                Fri Mar 31 02:17:07 2023                                                ┊
┊                rank ▻ 32                                                                                               ┊
┊                node ▻ gadi-cpu-spr-0067.gadi.nci.org.au                                                                ┊
┊                year ▻ 2011                                                                                             ┊
┊              in_dir ▻ /g/data/rt52/era5/pressure-levels/reanalysis/t/2011/*                                            ┊
┊            out_file ▻ /g/data/wb00/admin/testing/nci_5.625/test_test/temperature_2011_5.625.nc                         ┊
└────────────────────────────────────────────────────────────────────────────────────────────────────────────────────────┘
<xarray.Dataset>
Dimensions:    (longitude: 1440, latitude: 721, level: 37, time: 8760)
Coordinates:
  * longitude  (longitude) float32 -180.0 -179.8 -179.5 ... 179.2 179.5 179.8
  * latitude   (latitude) float32 90.0 89.75 89.5 89.25 ... -89.5 -89.75 -90.0
  * level      (level) int32 1 2 3 5 7 10 20 30 ... 850 875 900 925 950 975 1000
  * time       (time) datetime64[ns] 2011-01-01 ... 2011-12-31T23:00:00
Data variables:
    t          (time, level, latitude, longitude) float32 dask.array<chunksize=(744, 37, 721, 1440), meta=np.ndarray>
Attributes:
    Conventions:  CF-1.6
    history:      2020-11-24 05:38:42 UTC+1100 by era5_replication_tools-1.8....
    license:      Licence to use Copernicus Products: https://apps.ecmwf.int/...
    summary:      ERA5 is the fifth generation ECMWF atmospheric reanalysis o...
    title:        ERA5 pressure-levels oper temperature 20110101-20110131
━━━━━━━━━━━━━━━━━━━━━━━━━━━━━━━━━━━━━━━━━━━━━━━━━━━━━━━━━━━━━━━━━━━━━━━━━━━━━━━━━━━━━━━━━━━━━━━━━━━━━━━━━━━━━━━━━━━━━━━━━━


┌────────────────────────────────────────────────────────────────────────────────────────────────────────────────────────┐
┊                                                Fri Mar 31 02:17:09 2023                                                ┊
┊                rank ▻ 33                                                                                               ┊
┊                node ▻ gadi-cpu-spr-0067.gadi.nci.org.au                                                                ┊
┊                year ▻ 2012                                                                                             ┊
┊              in_dir ▻ /g/data/rt52/era5/pressure-levels/reanalysis/t/2012/*                                            ┊
┊            out_file ▻ /g/data/wb00/admin/testing/nci_5.625/test_test/temperature_2012_5.625.nc                         ┊
└────────────────────────────────────────────────────────────────────────────────────────────────────────────────────────┘
<xarray.Dataset>
Dimensions:    (longitude: 1440, latitude: 721, level: 37, time: 8784)
Coordinates:
  * longitude  (longitude) float32 -180.0 -179.8 -179.5 ... 179.2 179.5 179.8
  * latitude   (latitude) float32 90.0 89.75 89.5 89.25 ... -89.5 -89.75 -90.0
  * level      (level) int32 1 2 3 5 7 10 20 30 ... 850 875 900 925 950 975 1000
  * time       (time) datetime64[ns] 2012-01-01 ... 2012-12-31T23:00:00
Data variables:
    t          (time, level, latitude, longitude) float32 dask.array<chunksize=(744, 37, 721, 1440), meta=np.ndarray>
Attributes:
    Conventions:  CF-1.6
    history:      2020-11-23 14:27:04 UTC+1100 by era5_replication_tools-1.8....
    license:      Licence to use Copernicus Products: https://apps.ecmwf.int/...
    summary:      ERA5 is the fifth generation ECMWF atmospheric reanalysis o...
    title:        ERA5 pressure-levels oper temperature 20120101-20120131
━━━━━━━━━━━━━━━━━━━━━━━━━━━━━━━━━━━━━━━━━━━━━━━━━━━━━━━━━━━━━━━━━━━━━━━━━━━━━━━━━━━━━━━━━━━━━━━━━━━━━━━━━━━━━━━━━━━━━━━━━━


┌────────────────────────────────────────────────────────────────────────────────────────────────────────────────────────┐
┊                                                Fri Mar 31 02:17:11 2023                                                ┊
┊                rank ▻ 34                                                                                               ┊
┊                node ▻ gadi-cpu-spr-0067.gadi.nci.org.au                                                                ┊
┊                year ▻ 2013                                                                                             ┊
┊              in_dir ▻ /g/data/rt52/era5/pressure-levels/reanalysis/t/2013/*                                            ┊
┊            out_file ▻ /g/data/wb00/admin/testing/nci_5.625/test_test/temperature_2013_5.625.nc                         ┊
└────────────────────────────────────────────────────────────────────────────────────────────────────────────────────────┘
<xarray.Dataset>
Dimensions:    (longitude: 1440, latitude: 721, level: 37, time: 8760)
Coordinates:
  * longitude  (longitude) float32 -180.0 -179.8 -179.5 ... 179.2 179.5 179.8
  * latitude   (latitude) float32 90.0 89.75 89.5 89.25 ... -89.5 -89.75 -90.0
  * level      (level) int32 1 2 3 5 7 10 20 30 ... 850 875 900 925 950 975 1000
  * time       (time) datetime64[ns] 2013-01-01 ... 2013-12-31T23:00:00
Data variables:
    t          (time, level, latitude, longitude) float32 dask.array<chunksize=(744, 37, 721, 1440), meta=np.ndarray>
Attributes:
    Conventions:  CF-1.6
    history:      2020-11-22 20:21:19 UTC+1100 by era5_replication_tools-1.7....
    license:      Licence to use Copernicus Products: https://apps.ecmwf.int/...
    summary:      ERA5 is the fifth generation ECMWF atmospheric reanalysis o...
    title:        ERA5 pressure-levels oper temperature 20130101-20130131
━━━━━━━━━━━━━━━━━━━━━━━━━━━━━━━━━━━━━━━━━━━━━━━━━━━━━━━━━━━━━━━━━━━━━━━━━━━━━━━━━━━━━━━━━━━━━━━━━━━━━━━━━━━━━━━━━━━━━━━━━━


┌────────────────────────────────────────────────────────────────────────────────────────────────────────────────────────┐
┊                                                Fri Mar 31 02:17:13 2023                                                ┊
┊                rank ▻ 35                                                                                               ┊
┊                node ▻ gadi-cpu-spr-0067.gadi.nci.org.au                                                                ┊
┊                year ▻ 2014                                                                                             ┊
┊              in_dir ▻ /g/data/rt52/era5/pressure-levels/reanalysis/t/2014/*                                            ┊
┊            out_file ▻ /g/data/wb00/admin/testing/nci_5.625/test_test/temperature_2014_5.625.nc                         ┊
└────────────────────────────────────────────────────────────────────────────────────────────────────────────────────────┘
<xarray.Dataset>
Dimensions:    (longitude: 1440, latitude: 721, level: 37, time: 8760)
Coordinates:
  * longitude  (longitude) float32 -180.0 -179.8 -179.5 ... 179.2 179.5 179.8
  * latitude   (latitude) float32 90.0 89.75 89.5 89.25 ... -89.5 -89.75 -90.0
  * level      (level) int32 1 2 3 5 7 10 20 30 ... 850 875 900 925 950 975 1000
  * time       (time) datetime64[ns] 2014-01-01 ... 2014-12-31T23:00:00
Data variables:
    t          (time, level, latitude, longitude) float32 dask.array<chunksize=(744, 37, 721, 1440), meta=np.ndarray>
Attributes:
    Conventions:  CF-1.6
    history:      2020-11-22 00:25:39 UTC+1100 by era5_replication_tools-1.7....
    license:      Licence to use Copernicus Products: https://apps.ecmwf.int/...
    summary:      ERA5 is the fifth generation ECMWF atmospheric reanalysis o...
    title:        ERA5 pressure-levels oper temperature 20140101-20140131
━━━━━━━━━━━━━━━━━━━━━━━━━━━━━━━━━━━━━━━━━━━━━━━━━━━━━━━━━━━━━━━━━━━━━━━━━━━━━━━━━━━━━━━━━━━━━━━━━━━━━━━━━━━━━━━━━━━━━━━━━━


┌────────────────────────────────────────────────────────────────────────────────────────────────────────────────────────┐
┊                                                Fri Mar 31 02:17:15 2023                                                ┊
┊                rank ▻ 36                                                                                               ┊
┊                node ▻ gadi-cpu-spr-0067.gadi.nci.org.au                                                                ┊
┊                year ▻ 2015                                                                                             ┊
┊              in_dir ▻ /g/data/rt52/era5/pressure-levels/reanalysis/t/2015/*                                            ┊
┊            out_file ▻ /g/data/wb00/admin/testing/nci_5.625/test_test/temperature_2015_5.625.nc                         ┊
└────────────────────────────────────────────────────────────────────────────────────────────────────────────────────────┘
<xarray.Dataset>
Dimensions:    (longitude: 1440, latitude: 721, level: 37, time: 8760)
Coordinates:
  * longitude  (longitude) float32 -180.0 -179.8 -179.5 ... 179.2 179.5 179.8
  * latitude   (latitude) float32 90.0 89.75 89.5 89.25 ... -89.5 -89.75 -90.0
  * level      (level) int32 1 2 3 5 7 10 20 30 ... 850 875 900 925 950 975 1000
  * time       (time) datetime64[ns] 2015-01-01 ... 2015-12-31T23:00:00
Data variables:
    t          (time, level, latitude, longitude) float32 dask.array<chunksize=(744, 37, 721, 1440), meta=np.ndarray>
Attributes:
    Conventions:  CF-1.6
    history:      2020-11-21 01:05:59 UTC+1100 by era5_replication_tools-1.7....
    license:      Licence to use Copernicus Products: https://apps.ecmwf.int/...
    summary:      ERA5 is the fifth generation ECMWF atmospheric reanalysis o...
    title:        ERA5 pressure-levels oper temperature 20150101-20150131
━━━━━━━━━━━━━━━━━━━━━━━━━━━━━━━━━━━━━━━━━━━━━━━━━━━━━━━━━━━━━━━━━━━━━━━━━━━━━━━━━━━━━━━━━━━━━━━━━━━━━━━━━━━━━━━━━━━━━━━━━━


┌────────────────────────────────────────────────────────────────────────────────────────────────────────────────────────┐
┊                                                Fri Mar 31 02:17:17 2023                                                ┊
┊                rank ▻ 37                                                                                               ┊
┊                node ▻ gadi-cpu-spr-0067.gadi.nci.org.au                                                                ┊
┊                year ▻ 2016                                                                                             ┊
┊              in_dir ▻ /g/data/rt52/era5/pressure-levels/reanalysis/t/2016/*                                            ┊
┊            out_file ▻ /g/data/wb00/admin/testing/nci_5.625/test_test/temperature_2016_5.625.nc                         ┊
└────────────────────────────────────────────────────────────────────────────────────────────────────────────────────────┘
<xarray.Dataset>
Dimensions:    (longitude: 1440, latitude: 721, level: 37, time: 8784)
Coordinates:
  * longitude  (longitude) float32 -180.0 -179.8 -179.5 ... 179.2 179.5 179.8
  * latitude   (latitude) float32 90.0 89.75 89.5 89.25 ... -89.5 -89.75 -90.0
  * level      (level) int32 1 2 3 5 7 10 20 30 ... 850 875 900 925 950 975 1000
  * time       (time) datetime64[ns] 2016-01-01 ... 2016-12-31T23:00:00
Data variables:
    t          (time, level, latitude, longitude) float32 dask.array<chunksize=(744, 37, 721, 1440), meta=np.ndarray>
Attributes:
    Conventions:  CF-1.6
    history:      2020-11-20 01:38:39 UTC+1100 by era5_replication_tools-1.7....
    license:      Licence to use Copernicus Products: https://apps.ecmwf.int/...
    summary:      ERA5 is the fifth generation ECMWF atmospheric reanalysis o...
    title:        ERA5 pressure-levels oper temperature 20160101-20160131
━━━━━━━━━━━━━━━━━━━━━━━━━━━━━━━━━━━━━━━━━━━━━━━━━━━━━━━━━━━━━━━━━━━━━━━━━━━━━━━━━━━━━━━━━━━━━━━━━━━━━━━━━━━━━━━━━━━━━━━━━━


┌────────────────────────────────────────────────────────────────────────────────────────────────────────────────────────┐
┊                                                Fri Mar 31 02:17:19 2023                                                ┊
┊                rank ▻ 38                                                                                               ┊
┊                node ▻ gadi-cpu-spr-0067.gadi.nci.org.au                                                                ┊
┊                year ▻ 2017                                                                                             ┊
┊              in_dir ▻ /g/data/rt52/era5/pressure-levels/reanalysis/t/2017/*                                            ┊
┊            out_file ▻ /g/data/wb00/admin/testing/nci_5.625/test_test/temperature_2017_5.625.nc                         ┊
└────────────────────────────────────────────────────────────────────────────────────────────────────────────────────────┘
<xarray.Dataset>
Dimensions:    (longitude: 1440, latitude: 721, level: 37, time: 8760)
Coordinates:
  * longitude  (longitude) float32 -180.0 -179.8 -179.5 ... 179.2 179.5 179.8
  * latitude   (latitude) float32 90.0 89.75 89.5 89.25 ... -89.5 -89.75 -90.0
  * level      (level) int32 1 2 3 5 7 10 20 30 ... 850 875 900 925 950 975 1000
  * time       (time) datetime64[ns] 2017-01-01 ... 2017-12-31T23:00:00
Data variables:
    t          (time, level, latitude, longitude) float32 dask.array<chunksize=(744, 37, 721, 1440), meta=np.ndarray>
Attributes:
    Conventions:  CF-1.6
    history:      2020-11-18 22:39:35 UTC+1100 by era5_replication_tools-1.7....
    license:      Licence to use Copernicus Products: https://apps.ecmwf.int/...
    summary:      ERA5 is the fifth generation ECMWF atmospheric reanalysis o...
    title:        ERA5 pressure-levels oper temperature 20170101-20170131
━━━━━━━━━━━━━━━━━━━━━━━━━━━━━━━━━━━━━━━━━━━━━━━━━━━━━━━━━━━━━━━━━━━━━━━━━━━━━━━━━━━━━━━━━━━━━━━━━━━━━━━━━━━━━━━━━━━━━━━━━━


┌────────────────────────────────────────────────────────────────────────────────────────────────────────────────────────┐
┊                                                Fri Mar 31 02:17:21 2023                                                ┊
┊                rank ▻ 39                                                                                               ┊
┊                node ▻ gadi-cpu-spr-0067.gadi.nci.org.au                                                                ┊
┊                year ▻ 2018                                                                                             ┊
┊              in_dir ▻ /g/data/rt52/era5/pressure-levels/reanalysis/t/2018/*                                            ┊
┊            out_file ▻ /g/data/wb00/admin/testing/nci_5.625/test_test/temperature_2018_5.625.nc                         ┊
└────────────────────────────────────────────────────────────────────────────────────────────────────────────────────────┘
<xarray.Dataset>
Dimensions:    (longitude: 1440, latitude: 721, level: 37, time: 8760)
Coordinates:
  * longitude  (longitude) float32 -180.0 -179.8 -179.5 ... 179.2 179.5 179.8
  * latitude   (latitude) float32 90.0 89.75 89.5 89.25 ... -89.5 -89.75 -90.0
  * level      (level) int32 1 2 3 5 7 10 20 30 ... 850 875 900 925 950 975 1000
  * time       (time) datetime64[ns] 2018-01-01 ... 2018-12-31T23:00:00
Data variables:
    t          (time, level, latitude, longitude) float32 dask.array<chunksize=(744, 37, 721, 1440), meta=np.ndarray>
Attributes:
    Conventions:  CF-1.6
    history:      2020-11-17 23:08:39 UTC+1100 by era5_replication_tools-1.7....
    license:      Licence to use Copernicus Products: https://apps.ecmwf.int/...
    summary:      ERA5 is the fifth generation ECMWF atmospheric reanalysis o...
    title:        ERA5 pressure-levels oper temperature 20180101-20180131
━━━━━━━━━━━━━━━━━━━━━━━━━━━━━━━━━━━━━━━━━━━━━━━━━━━━━━━━━━━━━━━━━━━━━━━━━━━━━━━━━━━━━━━━━━━━━━━━━━━━━━━━━━━━━━━━━━━━━━━━━━


[Fri 31 04:13:52]  End rank: 38,  Out file: /g/data/wb00/admin/testing/nci_5.625/test_test/temperature_2017_5.625.nc            ( 116m, 32s)

[Fri 31 04:15:48]  End rank: 35,  Out file: /g/data/wb00/admin/testing/nci_5.625/test_test/temperature_2014_5.625.nc            ( 118m, 34s)

[Fri 31 04:16:54]  End rank: 37,  Out file: /g/data/wb00/admin/testing/nci_5.625/test_test/temperature_2016_5.625.nc            ( 119m, 36s)

[Fri 31 04:17:13]  End rank: 27,  Out file: /g/data/wb00/admin/testing/nci_5.625/test_test/temperature_2006_5.625.nc            ( 120m, 15s)

[Fri 31 04:18:12]  End rank: 33,  Out file: /g/data/wb00/admin/testing/nci_5.625/test_test/temperature_2012_5.625.nc            ( 121m,  2s)

[Fri 31 04:21:00]  End rank: 26,  Out file: /g/data/wb00/admin/testing/nci_5.625/test_test/temperature_2005_5.625.nc            ( 124m,  4s)

[Fri 31 04:23:22]  End rank: 32,  Out file: /g/data/wb00/admin/testing/nci_5.625/test_test/temperature_2011_5.625.nc            ( 126m, 14s)

[Fri 31 04:25:36]  End rank: 30,  Out file: /g/data/wb00/admin/testing/nci_5.625/test_test/temperature_2009_5.625.nc            ( 128m, 32s)

[Fri 31 04:26:20]  End rank: 11,  Out file: /g/data/wb00/admin/testing/nci_5.625/test_test/temperature_1990_5.625.nc            ( 129m, 54s)

[Fri 31 04:26:30]  End rank: 25,  Out file: /g/data/wb00/admin/testing/nci_5.625/test_test/temperature_2004_5.625.nc            ( 129m, 36s)

[Fri 31 04:26:39]  End rank: 31,  Out file: /g/data/wb00/admin/testing/nci_5.625/test_test/temperature_2010_5.625.nc            ( 129m, 33s)

[Fri 31 04:27:34]  End rank: 34,  Out file: /g/data/wb00/admin/testing/nci_5.625/test_test/temperature_2013_5.625.nc            ( 130m, 22s)

[Fri 31 04:27:51]  End rank: 19,  Out file: /g/data/wb00/admin/testing/nci_5.625/test_test/temperature_1998_5.625.nc            ( 131m,  9s)

[Fri 31 04:28:46]  End rank: 6,   Out file: /g/data/wb00/admin/testing/nci_5.625/test_test/temperature_1985_5.625.nc            ( 132m, 31s)

[Fri 31 04:30:14]  End rank: 21,  Out file: /g/data/wb00/admin/testing/nci_5.625/test_test/temperature_2000_5.625.nc            ( 133m, 28s)

[Fri 31 04:30:58]  End rank: 29,  Out file: /g/data/wb00/admin/testing/nci_5.625/test_test/temperature_2008_5.625.nc            ( 133m, 57s)

[Fri 31 04:31:14]  End rank: 39,  Out file: /g/data/wb00/admin/testing/nci_5.625/test_test/temperature_2018_5.625.nc            ( 133m, 53s)

[Fri 31 04:34:13]  End rank: 13,  Out file: /g/data/wb00/admin/testing/nci_5.625/test_test/temperature_1992_5.625.nc            ( 137m, 43s)

[Fri 31 04:34:32]  End rank: 10,  Out file: /g/data/wb00/admin/testing/nci_5.625/test_test/temperature_1989_5.625.nc            ( 138m,  9s)

[Fri 31 04:35:27]  End rank: 22,  Out file: /g/data/wb00/admin/testing/nci_5.625/test_test/temperature_2001_5.625.nc            ( 138m, 39s)

[Fri 31 04:37:34]  End rank: 23,  Out file: /g/data/wb00/admin/testing/nci_5.625/test_test/temperature_2002_5.625.nc            ( 140m, 45s)

[Fri 31 04:39:29]  End rank: 7,   Out file: /g/data/wb00/admin/testing/nci_5.625/test_test/temperature_1986_5.625.nc            ( 143m, 12s)

[Fri 31 04:42:01]  End rank: 15,  Out file: /g/data/wb00/admin/testing/nci_5.625/test_test/temperature_1994_5.625.nc            ( 145m, 27s)

[Fri 31 04:42:23]  End rank: 18,  Out file: /g/data/wb00/admin/testing/nci_5.625/test_test/temperature_1997_5.625.nc            ( 145m, 43s)

[Fri 31 04:42:48]  End rank: 14,  Out file: /g/data/wb00/admin/testing/nci_5.625/test_test/temperature_1993_5.625.nc            ( 146m, 17s)

[Fri 31 04:46:59]  End rank: 4,   Out file: /g/data/wb00/admin/testing/nci_5.625/test_test/temperature_1983_5.625.nc            ( 150m, 47s)

[Fri 31 04:50:22]  End rank: 36,  Out file: /g/data/wb00/admin/testing/nci_5.625/test_test/temperature_2015_5.625.nc            ( 153m,  6s)

[Fri 31 04:51:55]  End rank: 28,  Out file: /g/data/wb00/admin/testing/nci_5.625/test_test/temperature_2007_5.625.nc            ( 154m, 56s)

[Fri 31 04:53:00]  End rank: 9,   Out file: /g/data/wb00/admin/testing/nci_5.625/test_test/temperature_1988_5.625.nc            ( 156m, 38s)

[Fri 31 04:53:01]  End rank: 17,  Out file: /g/data/wb00/admin/testing/nci_5.625/test_test/temperature_1996_5.625.nc            ( 156m, 23s)

[Fri 31 04:58:53]  End rank: 16,  Out file: /g/data/wb00/admin/testing/nci_5.625/test_test/temperature_1995_5.625.nc            ( 162m, 17s)

[Fri 31 05:03:05]  End rank: 24,  Out file: /g/data/wb00/admin/testing/nci_5.625/test_test/temperature_2003_5.625.nc            ( 166m, 14s)

[Fri 31 05:06:44]  End rank: 8,   Out file: /g/data/wb00/admin/testing/nci_5.625/test_test/temperature_1987_5.625.nc            ( 170m, 25s)

[Fri 31 05:12:04]  End rank: 0,   Out file: /g/data/wb00/admin/testing/nci_5.625/test_test/temperature_1979_5.625.nc            ( 176m,  3s)

[Fri 31 05:12:08]  End rank: 12,  Out file: /g/data/wb00/admin/testing/nci_5.625/test_test/temperature_1991_5.625.nc            ( 175m, 41s)

[Fri 31 05:13:14]  End rank: 3,   Out file: /g/data/wb00/admin/testing/nci_5.625/test_test/temperature_1982_5.625.nc            ( 177m,  4s)

[Fri 31 05:26:50]  End rank: 5,   Out file: /g/data/wb00/admin/testing/nci_5.625/test_test/temperature_1984_5.625.nc            ( 190m, 36s)

[Fri 31 05:35:57]  End rank: 20,  Out file: /g/data/wb00/admin/testing/nci_5.625/test_test/temperature_1999_5.625.nc            ( 199m, 13s)

[Fri 31 05:45:58]  End rank: 1,   Out file: /g/data/wb00/admin/testing/nci_5.625/test_test/temperature_1980_5.625.nc            ( 209m, 52s)

[Fri 31 06:12:39]  End rank: 2,   Out file: /g/data/wb00/admin/testing/nci_5.625/test_test/temperature_1981_5.625.nc            ( 236m, 31s)


======================================================================================
                  Resource Usage on 2023-03-31 06:13:43:
   Job Id:             78252586.gadi-pbs
   Project:            fp0
   Exit Status:        0
   Service Units:      3300.27
   NCPUs Requested:    416                    NCPUs Used: 416             
                                           CPU Time Used: 75:37:46        
   Memory Requested:   2.0TB                 Memory Used: 1.74TB          
   Walltime requested: 05:00:00            Walltime Used: 03:58:00        
   JobFS requested:    400.0GB                JobFS used: 320.04KB        
======================================================================================
