
======================   ALLOCATED NODES   ======================
	gadi-cpu-clx-2521: flags=0x11 slots=48 max_slots=0 slots_inuse=0 state=UP
	gadi-cpu-clx-2522: flags=0x13 slots=48 max_slots=0 slots_inuse=0 state=UP
	gadi-cpu-clx-2523: flags=0x13 slots=48 max_slots=0 slots_inuse=0 state=UP
	gadi-cpu-clx-2524: flags=0x13 slots=48 max_slots=0 slots_inuse=0 state=UP
	gadi-cpu-clx-2525: flags=0x13 slots=48 max_slots=0 slots_inuse=0 state=UP
	gadi-cpu-clx-2526: flags=0x13 slots=48 max_slots=0 slots_inuse=0 state=UP
	gadi-cpu-clx-2527: flags=0x13 slots=48 max_slots=0 slots_inuse=0 state=UP
	gadi-cpu-clx-2528: flags=0x13 slots=48 max_slots=0 slots_inuse=0 state=UP
	gadi-cpu-clx-2529: flags=0x13 slots=48 max_slots=0 slots_inuse=0 state=UP
	gadi-cpu-clx-2530: flags=0x13 slots=48 max_slots=0 slots_inuse=0 state=UP
=================================================================
App launch reported: 10 (out of 10) daemons - 9 (out of 10) procs
rank: 32    host: gadi-cpu-clx-2529.gadi.nci.org.au
rank: 33    host: gadi-cpu-clx-2529.gadi.nci.org.au
rank: 0     host: gadi-cpu-clx-2521.gadi.nci.org.au
rank: 34    host: gadi-cpu-clx-2529.gadi.nci.org.au
rank: 1     host: gadi-cpu-clx-2521.gadi.nci.org.au
rank: 35    host: gadi-cpu-clx-2529.gadi.nci.org.au
rank: 2     host: gadi-cpu-clx-2521.gadi.nci.org.au
rank: 3     host: gadi-cpu-clx-2521.gadi.nci.org.au
rank: 12    host: gadi-cpu-clx-2524.gadi.nci.org.au
rank: 13    host: gadi-cpu-clx-2524.gadi.nci.org.au
rank: 14    host: gadi-cpu-clx-2524.gadi.nci.org.au
rank: 28    host: gadi-cpu-clx-2528.gadi.nci.org.au
rank: 15    host: gadi-cpu-clx-2524.gadi.nci.org.au
rank: 36    host: gadi-cpu-clx-2530.gadi.nci.org.au
rank: 29    host: gadi-cpu-clx-2528.gadi.nci.org.au
rank: 16    host: gadi-cpu-clx-2525.gadi.nci.org.au
rank: 30    host: gadi-cpu-clx-2528.gadi.nci.org.au
rank: 37    host: gadi-cpu-clx-2530.gadi.nci.org.au
rank: 17    host: gadi-cpu-clx-2525.gadi.nci.org.au
rank: 31    host: gadi-cpu-clx-2528.gadi.nci.org.au
rank: 38    host: gadi-cpu-clx-2530.gadi.nci.org.au
rank: 18    host: gadi-cpu-clx-2525.gadi.nci.org.au
rank: 39    host: gadi-cpu-clx-2530.gadi.nci.org.au
rank: 19    host: gadi-cpu-clx-2525.gadi.nci.org.au
rank: 20    host: gadi-cpu-clx-2526.gadi.nci.org.au
rank: 4     host: gadi-cpu-clx-2522.gadi.nci.org.au
rank: 21    host: gadi-cpu-clx-2526.gadi.nci.org.au
rank: 5     host: gadi-cpu-clx-2522.gadi.nci.org.au
rank: 22    host: gadi-cpu-clx-2526.gadi.nci.org.au
rank: 6     host: gadi-cpu-clx-2522.gadi.nci.org.au
rank: 23    host: gadi-cpu-clx-2526.gadi.nci.org.au
rank: 7     host: gadi-cpu-clx-2522.gadi.nci.org.au
rank: 8     host: gadi-cpu-clx-2523.gadi.nci.org.au
rank: 24    host: gadi-cpu-clx-2527.gadi.nci.org.au
rank: 9     host: gadi-cpu-clx-2523.gadi.nci.org.au
rank: 25    host: gadi-cpu-clx-2527.gadi.nci.org.au
rank: 10    host: gadi-cpu-clx-2523.gadi.nci.org.au
rank: 26    host: gadi-cpu-clx-2527.gadi.nci.org.au
rank: 11    host: gadi-cpu-clx-2523.gadi.nci.org.au
rank: 27    host: gadi-cpu-clx-2527.gadi.nci.org.au
╔════════════════════════════════════════════════════════════════════════════════════════════════════════════════════════╗
║ ╔════════════════════════════════════════════════════════════════════════════════════════════════════════════════════╗ ║
║ ║                                                    Common Param                                                    ║ ║
║ ║           ERA_param ▶ u                                                                                            ║ ║
║ ║    config_file_path ▶ /scratch/fp0/mah900/WeatherBench/pbs_scripts/config_u_component_of_wind.yaml                 ║ ║
║ ║             out_deg ▶ 5.625000                                                                                     ║ ║
║ ║           algorithm ▶ bilinear                                                                                     ║ ║
║ ║      pressure_level ▶ [50, 100, 150, 200, 250, 300, 400, 500, 600, 700, 850, 925, 1000]                            ║ ║
║ ║       in_dir_prefix ▶ /g/data/rt52/era5/pressure-levels/reanalysis/u                                               ║ ║
║ ║     out_file_prefix ▶ /g/data/wb00/admin/testing/nci_5.625/u_component_of_wind/u_component_of_wind                 ║ ║
║ ╚════════════════════════════════════════════════════════════════════════════════════════════════════════════════════╝ ║
╚════════════════════════════════════════════════════════════════════════════════════════════════════════════════════════╝


┌────────────────────────────────────────────────────────────────────────────────────────────────────────────────────────┐
┊                                                Sun Mar 19 21:34:37 2023                                                ┊
┊                rank ▻ 0                                                                                                ┊
┊                node ▻ gadi-cpu-clx-2521.gadi.nci.org.au                                                                ┊
┊                year ▻ 1979                                                                                             ┊
┊              in_dir ▻ /g/data/rt52/era5/pressure-levels/reanalysis/u/1979/*                                            ┊
┊            out_file ▻ /g/data/wb00/admin/testing/nci_5.625/u_component_of_wind/u_component_of_wind_1979_5.625.nc       ┊
└────────────────────────────────────────────────────────────────────────────────────────────────────────────────────────┘
<xarray.Dataset>
Dimensions:    (longitude: 1440, latitude: 721, level: 37, time: 8760)
Coordinates:
  * longitude  (longitude) float32 -180.0 -179.8 -179.5 ... 179.2 179.5 179.8
  * latitude   (latitude) float32 90.0 89.75 89.5 89.25 ... -89.5 -89.75 -90.0
  * level      (level) int32 1 2 3 5 7 10 20 30 ... 850 875 900 925 950 975 1000
  * time       (time) datetime64[ns] 1979-01-01 ... 1979-12-31T23:00:00
Data variables:
    u          (time, level, latitude, longitude) float32 dask.array<chunksize=(4, 37, 721, 1440), meta=np.ndarray>
Attributes:
    Conventions:  CF-1.6
    history:      2020-11-07 11:13:12 UTC+1100 by era5_replication_tools-1.2....
    license:      Licence to use Copernicus Products: https://apps.ecmwf.int/...
    summary:      ERA5 is the fifth generation ECMWF atmospheric reanalysis o...
    title:        ERA5 pressure-levels oper u_component_of_wind 19790101-1979...
━━━━━━━━━━━━━━━━━━━━━━━━━━━━━━━━━━━━━━━━━━━━━━━━━━━━━━━━━━━━━━━━━━━━━━━━━━━━━━━━━━━━━━━━━━━━━━━━━━━━━━━━━━━━━━━━━━━━━━━━━━


┌────────────────────────────────────────────────────────────────────────────────────────────────────────────────────────┐
┊                                                Sun Mar 19 21:34:42 2023                                                ┊
┊                rank ▻ 1                                                                                                ┊
┊                node ▻ gadi-cpu-clx-2521.gadi.nci.org.au                                                                ┊
┊                year ▻ 1980                                                                                             ┊
┊              in_dir ▻ /g/data/rt52/era5/pressure-levels/reanalysis/u/1980/*                                            ┊
┊            out_file ▻ /g/data/wb00/admin/testing/nci_5.625/u_component_of_wind/u_component_of_wind_1980_5.625.nc       ┊
└────────────────────────────────────────────────────────────────────────────────────────────────────────────────────────┘
<xarray.Dataset>
Dimensions:    (longitude: 1440, latitude: 721, level: 37, time: 8784)
Coordinates:
  * longitude  (longitude) float32 -180.0 -179.8 -179.5 ... 179.2 179.5 179.8
  * latitude   (latitude) float32 90.0 89.75 89.5 89.25 ... -89.5 -89.75 -90.0
  * level      (level) int32 1 2 3 5 7 10 20 30 ... 850 875 900 925 950 975 1000
  * time       (time) datetime64[ns] 1980-01-01 ... 1980-12-31T23:00:00
Data variables:
    u          (time, level, latitude, longitude) float32 dask.array<chunksize=(4, 37, 721, 1440), meta=np.ndarray>
Attributes:
    Conventions:  CF-1.6
    history:      2020-11-06 15:36:41 UTC+1100 by era5_replication_tools-1.2....
    license:      Licence to use Copernicus Products: https://apps.ecmwf.int/...
    summary:      ERA5 is the fifth generation ECMWF atmospheric reanalysis o...
    title:        ERA5 pressure-levels oper u_component_of_wind 19800101-1980...
━━━━━━━━━━━━━━━━━━━━━━━━━━━━━━━━━━━━━━━━━━━━━━━━━━━━━━━━━━━━━━━━━━━━━━━━━━━━━━━━━━━━━━━━━━━━━━━━━━━━━━━━━━━━━━━━━━━━━━━━━━


┌────────────────────────────────────────────────────────────────────────────────────────────────────────────────────────┐
┊                                                Sun Mar 19 21:34:44 2023                                                ┊
┊                rank ▻ 2                                                                                                ┊
┊                node ▻ gadi-cpu-clx-2521.gadi.nci.org.au                                                                ┊
┊                year ▻ 1981                                                                                             ┊
┊              in_dir ▻ /g/data/rt52/era5/pressure-levels/reanalysis/u/1981/*                                            ┊
┊            out_file ▻ /g/data/wb00/admin/testing/nci_5.625/u_component_of_wind/u_component_of_wind_1981_5.625.nc       ┊
└────────────────────────────────────────────────────────────────────────────────────────────────────────────────────────┘
<xarray.Dataset>
Dimensions:    (longitude: 1440, latitude: 721, level: 37, time: 8760)
Coordinates:
  * longitude  (longitude) float32 -180.0 -179.8 -179.5 ... 179.2 179.5 179.8
  * latitude   (latitude) float32 90.0 89.75 89.5 89.25 ... -89.5 -89.75 -90.0
  * level      (level) int32 1 2 3 5 7 10 20 30 ... 850 875 900 925 950 975 1000
  * time       (time) datetime64[ns] 1981-01-01 ... 1981-12-31T23:00:00
Data variables:
    u          (time, level, latitude, longitude) float32 dask.array<chunksize=(4, 37, 721, 1440), meta=np.ndarray>
Attributes:
    Conventions:  CF-1.6
    history:      2020-11-05 21:18:20 UTC+1100 by era5_replication_tools-1.2....
    license:      Licence to use Copernicus Products: https://apps.ecmwf.int/...
    summary:      ERA5 is the fifth generation ECMWF atmospheric reanalysis o...
    title:        ERA5 pressure-levels oper u_component_of_wind 19810101-1981...
━━━━━━━━━━━━━━━━━━━━━━━━━━━━━━━━━━━━━━━━━━━━━━━━━━━━━━━━━━━━━━━━━━━━━━━━━━━━━━━━━━━━━━━━━━━━━━━━━━━━━━━━━━━━━━━━━━━━━━━━━━


┌────────────────────────────────────────────────────────────────────────────────────────────────────────────────────────┐
┊                                                Sun Mar 19 21:34:46 2023                                                ┊
┊                rank ▻ 3                                                                                                ┊
┊                node ▻ gadi-cpu-clx-2521.gadi.nci.org.au                                                                ┊
┊                year ▻ 1982                                                                                             ┊
┊              in_dir ▻ /g/data/rt52/era5/pressure-levels/reanalysis/u/1982/*                                            ┊
┊            out_file ▻ /g/data/wb00/admin/testing/nci_5.625/u_component_of_wind/u_component_of_wind_1982_5.625.nc       ┊
└────────────────────────────────────────────────────────────────────────────────────────────────────────────────────────┘
<xarray.Dataset>
Dimensions:    (longitude: 1440, latitude: 721, level: 37, time: 8760)
Coordinates:
  * longitude  (longitude) float32 -180.0 -179.8 -179.5 ... 179.2 179.5 179.8
  * latitude   (latitude) float32 90.0 89.75 89.5 89.25 ... -89.5 -89.75 -90.0
  * level      (level) int32 1 2 3 5 7 10 20 30 ... 850 875 900 925 950 975 1000
  * time       (time) datetime64[ns] 1982-01-01 ... 1982-12-31T23:00:00
Data variables:
    u          (time, level, latitude, longitude) float32 dask.array<chunksize=(4, 37, 721, 1440), meta=np.ndarray>
Attributes:
    Conventions:  CF-1.6
    history:      2020-11-04 23:50:45 UTC+1100 by era5_replication_tools-1.2....
    license:      Licence to use Copernicus Products: https://apps.ecmwf.int/...
    summary:      ERA5 is the fifth generation ECMWF atmospheric reanalysis o...
    title:        ERA5 pressure-levels oper u_component_of_wind 19820101-1982...
━━━━━━━━━━━━━━━━━━━━━━━━━━━━━━━━━━━━━━━━━━━━━━━━━━━━━━━━━━━━━━━━━━━━━━━━━━━━━━━━━━━━━━━━━━━━━━━━━━━━━━━━━━━━━━━━━━━━━━━━━━


┌────────────────────────────────────────────────────────────────────────────────────────────────────────────────────────┐
┊                                                Sun Mar 19 21:34:48 2023                                                ┊
┊                rank ▻ 4                                                                                                ┊
┊                node ▻ gadi-cpu-clx-2522.gadi.nci.org.au                                                                ┊
┊                year ▻ 1983                                                                                             ┊
┊              in_dir ▻ /g/data/rt52/era5/pressure-levels/reanalysis/u/1983/*                                            ┊
┊            out_file ▻ /g/data/wb00/admin/testing/nci_5.625/u_component_of_wind/u_component_of_wind_1983_5.625.nc       ┊
└────────────────────────────────────────────────────────────────────────────────────────────────────────────────────────┘
<xarray.Dataset>
Dimensions:    (longitude: 1440, latitude: 721, level: 37, time: 8760)
Coordinates:
  * longitude  (longitude) float32 -180.0 -179.8 -179.5 ... 179.2 179.5 179.8
  * latitude   (latitude) float32 90.0 89.75 89.5 89.25 ... -89.5 -89.75 -90.0
  * level      (level) int32 1 2 3 5 7 10 20 30 ... 850 875 900 925 950 975 1000
  * time       (time) datetime64[ns] 1983-01-01 ... 1983-12-31T23:00:00
Data variables:
    u          (time, level, latitude, longitude) float32 dask.array<chunksize=(4, 37, 721, 1440), meta=np.ndarray>
Attributes:
    Conventions:  CF-1.6
    history:      2020-11-04 08:18:27 UTC+1100 by era5_replication_tools-1.2....
    license:      Licence to use Copernicus Products: https://apps.ecmwf.int/...
    summary:      ERA5 is the fifth generation ECMWF atmospheric reanalysis o...
    title:        ERA5 pressure-levels oper u_component_of_wind 19830101-1983...
━━━━━━━━━━━━━━━━━━━━━━━━━━━━━━━━━━━━━━━━━━━━━━━━━━━━━━━━━━━━━━━━━━━━━━━━━━━━━━━━━━━━━━━━━━━━━━━━━━━━━━━━━━━━━━━━━━━━━━━━━━


┌────────────────────────────────────────────────────────────────────────────────────────────────────────────────────────┐
┊                                                Sun Mar 19 21:34:50 2023                                                ┊
┊                rank ▻ 5                                                                                                ┊
┊                node ▻ gadi-cpu-clx-2522.gadi.nci.org.au                                                                ┊
┊                year ▻ 1984                                                                                             ┊
┊              in_dir ▻ /g/data/rt52/era5/pressure-levels/reanalysis/u/1984/*                                            ┊
┊            out_file ▻ /g/data/wb00/admin/testing/nci_5.625/u_component_of_wind/u_component_of_wind_1984_5.625.nc       ┊
└────────────────────────────────────────────────────────────────────────────────────────────────────────────────────────┘
<xarray.Dataset>
Dimensions:    (longitude: 1440, latitude: 721, level: 37, time: 8784)
Coordinates:
  * longitude  (longitude) float32 -180.0 -179.8 -179.5 ... 179.2 179.5 179.8
  * latitude   (latitude) float32 90.0 89.75 89.5 89.25 ... -89.5 -89.75 -90.0
  * level      (level) int32 1 2 3 5 7 10 20 30 ... 850 875 900 925 950 975 1000
  * time       (time) datetime64[ns] 1984-01-01 ... 1984-12-31T23:00:00
Data variables:
    u          (time, level, latitude, longitude) float32 dask.array<chunksize=(4, 37, 721, 1440), meta=np.ndarray>
Attributes:
    Conventions:  CF-1.6
    history:      2020-11-03 14:20:18 UTC+1100 by era5_replication_tools-1.2....
    license:      Licence to use Copernicus Products: https://apps.ecmwf.int/...
    summary:      ERA5 is the fifth generation ECMWF atmospheric reanalysis o...
    title:        ERA5 pressure-levels oper u_component_of_wind 19840101-1984...
━━━━━━━━━━━━━━━━━━━━━━━━━━━━━━━━━━━━━━━━━━━━━━━━━━━━━━━━━━━━━━━━━━━━━━━━━━━━━━━━━━━━━━━━━━━━━━━━━━━━━━━━━━━━━━━━━━━━━━━━━━


┌────────────────────────────────────────────────────────────────────────────────────────────────────────────────────────┐
┊                                                Sun Mar 19 21:34:52 2023                                                ┊
┊                rank ▻ 6                                                                                                ┊
┊                node ▻ gadi-cpu-clx-2522.gadi.nci.org.au                                                                ┊
┊                year ▻ 1985                                                                                             ┊
┊              in_dir ▻ /g/data/rt52/era5/pressure-levels/reanalysis/u/1985/*                                            ┊
┊            out_file ▻ /g/data/wb00/admin/testing/nci_5.625/u_component_of_wind/u_component_of_wind_1985_5.625.nc       ┊
└────────────────────────────────────────────────────────────────────────────────────────────────────────────────────────┘
<xarray.Dataset>
Dimensions:    (longitude: 1440, latitude: 721, level: 37, time: 8760)
Coordinates:
  * longitude  (longitude) float32 -180.0 -179.8 -179.5 ... 179.2 179.5 179.8
  * latitude   (latitude) float32 90.0 89.75 89.5 89.25 ... -89.5 -89.75 -90.0
  * level      (level) int32 1 2 3 5 7 10 20 30 ... 850 875 900 925 950 975 1000
  * time       (time) datetime64[ns] 1985-01-01 ... 1985-12-31T23:00:00
Data variables:
    u          (time, level, latitude, longitude) float32 dask.array<chunksize=(4, 37, 721, 1440), meta=np.ndarray>
Attributes:
    Conventions:  CF-1.6
    history:      2020-11-02 20:20:55 UTC+1100 by era5_replication_tools-1.2....
    license:      Licence to use Copernicus Products: https://apps.ecmwf.int/...
    summary:      ERA5 is the fifth generation ECMWF atmospheric reanalysis o...
    title:        ERA5 pressure-levels oper u_component_of_wind 19850101-1985...
━━━━━━━━━━━━━━━━━━━━━━━━━━━━━━━━━━━━━━━━━━━━━━━━━━━━━━━━━━━━━━━━━━━━━━━━━━━━━━━━━━━━━━━━━━━━━━━━━━━━━━━━━━━━━━━━━━━━━━━━━━


┌────────────────────────────────────────────────────────────────────────────────────────────────────────────────────────┐
┊                                                Sun Mar 19 21:34:54 2023                                                ┊
┊                rank ▻ 7                                                                                                ┊
┊                node ▻ gadi-cpu-clx-2522.gadi.nci.org.au                                                                ┊
┊                year ▻ 1986                                                                                             ┊
┊              in_dir ▻ /g/data/rt52/era5/pressure-levels/reanalysis/u/1986/*                                            ┊
┊            out_file ▻ /g/data/wb00/admin/testing/nci_5.625/u_component_of_wind/u_component_of_wind_1986_5.625.nc       ┊
└────────────────────────────────────────────────────────────────────────────────────────────────────────────────────────┘
<xarray.Dataset>
Dimensions:    (longitude: 1440, latitude: 721, level: 37, time: 8760)
Coordinates:
  * longitude  (longitude) float32 -180.0 -179.8 -179.5 ... 179.2 179.5 179.8
  * latitude   (latitude) float32 90.0 89.75 89.5 89.25 ... -89.5 -89.75 -90.0
  * level      (level) int32 1 2 3 5 7 10 20 30 ... 850 875 900 925 950 975 1000
  * time       (time) datetime64[ns] 1986-01-01 ... 1986-12-31T23:00:00
Data variables:
    u          (time, level, latitude, longitude) float32 dask.array<chunksize=(4, 37, 721, 1440), meta=np.ndarray>
Attributes:
    Conventions:  CF-1.6
    history:      2020-11-02 04:00:49 UTC+1100 by era5_replication_tools-1.2....
    license:      Licence to use Copernicus Products: https://apps.ecmwf.int/...
    summary:      ERA5 is the fifth generation ECMWF atmospheric reanalysis o...
    title:        ERA5 pressure-levels oper u_component_of_wind 19860101-1986...
━━━━━━━━━━━━━━━━━━━━━━━━━━━━━━━━━━━━━━━━━━━━━━━━━━━━━━━━━━━━━━━━━━━━━━━━━━━━━━━━━━━━━━━━━━━━━━━━━━━━━━━━━━━━━━━━━━━━━━━━━━


┌────────────────────────────────────────────────────────────────────────────────────────────────────────────────────────┐
┊                                                Sun Mar 19 21:34:55 2023                                                ┊
┊                rank ▻ 8                                                                                                ┊
┊                node ▻ gadi-cpu-clx-2523.gadi.nci.org.au                                                                ┊
┊                year ▻ 1987                                                                                             ┊
┊              in_dir ▻ /g/data/rt52/era5/pressure-levels/reanalysis/u/1987/*                                            ┊
┊            out_file ▻ /g/data/wb00/admin/testing/nci_5.625/u_component_of_wind/u_component_of_wind_1987_5.625.nc       ┊
└────────────────────────────────────────────────────────────────────────────────────────────────────────────────────────┘
<xarray.Dataset>
Dimensions:    (longitude: 1440, latitude: 721, level: 37, time: 8760)
Coordinates:
  * longitude  (longitude) float32 -180.0 -179.8 -179.5 ... 179.2 179.5 179.8
  * latitude   (latitude) float32 90.0 89.75 89.5 89.25 ... -89.5 -89.75 -90.0
  * level      (level) int32 1 2 3 5 7 10 20 30 ... 850 875 900 925 950 975 1000
  * time       (time) datetime64[ns] 1987-01-01 ... 1987-12-31T23:00:00
Data variables:
    u          (time, level, latitude, longitude) float32 dask.array<chunksize=(4, 37, 721, 1440), meta=np.ndarray>
Attributes:
    Conventions:  CF-1.6
    history:      2020-11-01 13:41:58 UTC+1100 by era5_replication_tools-1.2....
    license:      Licence to use Copernicus Products: https://apps.ecmwf.int/...
    summary:      ERA5 is the fifth generation ECMWF atmospheric reanalysis o...
    title:        ERA5 pressure-levels oper u_component_of_wind 19870101-1987...
━━━━━━━━━━━━━━━━━━━━━━━━━━━━━━━━━━━━━━━━━━━━━━━━━━━━━━━━━━━━━━━━━━━━━━━━━━━━━━━━━━━━━━━━━━━━━━━━━━━━━━━━━━━━━━━━━━━━━━━━━━


┌────────────────────────────────────────────────────────────────────────────────────────────────────────────────────────┐
┊                                                Sun Mar 19 21:34:57 2023                                                ┊
┊                rank ▻ 9                                                                                                ┊
┊                node ▻ gadi-cpu-clx-2523.gadi.nci.org.au                                                                ┊
┊                year ▻ 1988                                                                                             ┊
┊              in_dir ▻ /g/data/rt52/era5/pressure-levels/reanalysis/u/1988/*                                            ┊
┊            out_file ▻ /g/data/wb00/admin/testing/nci_5.625/u_component_of_wind/u_component_of_wind_1988_5.625.nc       ┊
└────────────────────────────────────────────────────────────────────────────────────────────────────────────────────────┘
<xarray.Dataset>
Dimensions:    (longitude: 1440, latitude: 721, level: 37, time: 8784)
Coordinates:
  * longitude  (longitude) float32 -180.0 -179.8 -179.5 ... 179.2 179.5 179.8
  * latitude   (latitude) float32 90.0 89.75 89.5 89.25 ... -89.5 -89.75 -90.0
  * level      (level) int32 1 2 3 5 7 10 20 30 ... 850 875 900 925 950 975 1000
  * time       (time) datetime64[ns] 1988-01-01 ... 1988-12-31T23:00:00
Data variables:
    u          (time, level, latitude, longitude) float32 dask.array<chunksize=(4, 37, 721, 1440), meta=np.ndarray>
Attributes:
    Conventions:  CF-1.6
    history:      2020-10-31 21:05:33 UTC+1100 by era5_replication_tools-1.2....
    license:      Licence to use Copernicus Products: https://apps.ecmwf.int/...
    summary:      ERA5 is the fifth generation ECMWF atmospheric reanalysis o...
    title:        ERA5 pressure-levels oper u_component_of_wind 19880101-1988...
━━━━━━━━━━━━━━━━━━━━━━━━━━━━━━━━━━━━━━━━━━━━━━━━━━━━━━━━━━━━━━━━━━━━━━━━━━━━━━━━━━━━━━━━━━━━━━━━━━━━━━━━━━━━━━━━━━━━━━━━━━


┌────────────────────────────────────────────────────────────────────────────────────────────────────────────────────────┐
┊                                                Sun Mar 19 21:34:59 2023                                                ┊
┊                rank ▻ 10                                                                                               ┊
┊                node ▻ gadi-cpu-clx-2523.gadi.nci.org.au                                                                ┊
┊                year ▻ 1989                                                                                             ┊
┊              in_dir ▻ /g/data/rt52/era5/pressure-levels/reanalysis/u/1989/*                                            ┊
┊            out_file ▻ /g/data/wb00/admin/testing/nci_5.625/u_component_of_wind/u_component_of_wind_1989_5.625.nc       ┊
└────────────────────────────────────────────────────────────────────────────────────────────────────────────────────────┘
<xarray.Dataset>
Dimensions:    (longitude: 1440, latitude: 721, level: 37, time: 8760)
Coordinates:
  * longitude  (longitude) float32 -180.0 -179.8 -179.5 ... 179.2 179.5 179.8
  * latitude   (latitude) float32 90.0 89.75 89.5 89.25 ... -89.5 -89.75 -90.0
  * level      (level) int32 1 2 3 5 7 10 20 30 ... 850 875 900 925 950 975 1000
  * time       (time) datetime64[ns] 1989-01-01 ... 1989-12-31T23:00:00
Data variables:
    u          (time, level, latitude, longitude) float32 dask.array<chunksize=(4, 37, 721, 1440), meta=np.ndarray>
Attributes:
    Conventions:  CF-1.6
    history:      2020-10-31 02:46:32 UTC+1100 by era5_replication_tools-1.2....
    license:      Licence to use Copernicus Products: https://apps.ecmwf.int/...
    summary:      ERA5 is the fifth generation ECMWF atmospheric reanalysis o...
    title:        ERA5 pressure-levels oper u_component_of_wind 19890101-1989...
━━━━━━━━━━━━━━━━━━━━━━━━━━━━━━━━━━━━━━━━━━━━━━━━━━━━━━━━━━━━━━━━━━━━━━━━━━━━━━━━━━━━━━━━━━━━━━━━━━━━━━━━━━━━━━━━━━━━━━━━━━


┌────────────────────────────────────────────────────────────────────────────────────────────────────────────────────────┐
┊                                                Sun Mar 19 21:35:01 2023                                                ┊
┊                rank ▻ 11                                                                                               ┊
┊                node ▻ gadi-cpu-clx-2523.gadi.nci.org.au                                                                ┊
┊                year ▻ 1990                                                                                             ┊
┊              in_dir ▻ /g/data/rt52/era5/pressure-levels/reanalysis/u/1990/*                                            ┊
┊            out_file ▻ /g/data/wb00/admin/testing/nci_5.625/u_component_of_wind/u_component_of_wind_1990_5.625.nc       ┊
└────────────────────────────────────────────────────────────────────────────────────────────────────────────────────────┘
<xarray.Dataset>
Dimensions:    (longitude: 1440, latitude: 721, level: 37, time: 8760)
Coordinates:
  * longitude  (longitude) float32 -180.0 -179.8 -179.5 ... 179.2 179.5 179.8
  * latitude   (latitude) float32 90.0 89.75 89.5 89.25 ... -89.5 -89.75 -90.0
  * level      (level) int32 1 2 3 5 7 10 20 30 ... 850 875 900 925 950 975 1000
  * time       (time) datetime64[ns] 1990-01-01 ... 1990-12-31T23:00:00
Data variables:
    u          (time, level, latitude, longitude) float32 dask.array<chunksize=(4, 37, 721, 1440), meta=np.ndarray>
Attributes:
    Conventions:  CF-1.6
    history:      2020-10-30 12:16:04 UTC+1100 by era5_replication_tools-1.2....
    license:      Licence to use Copernicus Products: https://apps.ecmwf.int/...
    summary:      ERA5 is the fifth generation ECMWF atmospheric reanalysis o...
    title:        ERA5 pressure-levels oper u_component_of_wind 19900101-1990...
━━━━━━━━━━━━━━━━━━━━━━━━━━━━━━━━━━━━━━━━━━━━━━━━━━━━━━━━━━━━━━━━━━━━━━━━━━━━━━━━━━━━━━━━━━━━━━━━━━━━━━━━━━━━━━━━━━━━━━━━━━


┌────────────────────────────────────────────────────────────────────────────────────────────────────────────────────────┐
┊                                                Sun Mar 19 21:35:02 2023                                                ┊
┊                rank ▻ 12                                                                                               ┊
┊                node ▻ gadi-cpu-clx-2524.gadi.nci.org.au                                                                ┊
┊                year ▻ 1991                                                                                             ┊
┊              in_dir ▻ /g/data/rt52/era5/pressure-levels/reanalysis/u/1991/*                                            ┊
┊            out_file ▻ /g/data/wb00/admin/testing/nci_5.625/u_component_of_wind/u_component_of_wind_1991_5.625.nc       ┊
└────────────────────────────────────────────────────────────────────────────────────────────────────────────────────────┘
<xarray.Dataset>
Dimensions:    (longitude: 1440, latitude: 721, level: 37, time: 8760)
Coordinates:
  * longitude  (longitude) float32 -180.0 -179.8 -179.5 ... 179.2 179.5 179.8
  * latitude   (latitude) float32 90.0 89.75 89.5 89.25 ... -89.5 -89.75 -90.0
  * level      (level) int32 1 2 3 5 7 10 20 30 ... 850 875 900 925 950 975 1000
  * time       (time) datetime64[ns] 1991-01-01 ... 1991-12-31T23:00:00
Data variables:
    u          (time, level, latitude, longitude) float32 dask.array<chunksize=(4, 37, 721, 1440), meta=np.ndarray>
Attributes:
    Conventions:  CF-1.6
    history:      2020-10-29 20:22:01 UTC+1100 by era5_replication_tools-1.2....
    license:      Licence to use Copernicus Products: https://apps.ecmwf.int/...
    summary:      ERA5 is the fifth generation ECMWF atmospheric reanalysis o...
    title:        ERA5 pressure-levels oper u_component_of_wind 19910101-1991...
━━━━━━━━━━━━━━━━━━━━━━━━━━━━━━━━━━━━━━━━━━━━━━━━━━━━━━━━━━━━━━━━━━━━━━━━━━━━━━━━━━━━━━━━━━━━━━━━━━━━━━━━━━━━━━━━━━━━━━━━━━


┌────────────────────────────────────────────────────────────────────────────────────────────────────────────────────────┐
┊                                                Sun Mar 19 21:35:04 2023                                                ┊
┊                rank ▻ 13                                                                                               ┊
┊                node ▻ gadi-cpu-clx-2524.gadi.nci.org.au                                                                ┊
┊                year ▻ 1992                                                                                             ┊
┊              in_dir ▻ /g/data/rt52/era5/pressure-levels/reanalysis/u/1992/*                                            ┊
┊            out_file ▻ /g/data/wb00/admin/testing/nci_5.625/u_component_of_wind/u_component_of_wind_1992_5.625.nc       ┊
└────────────────────────────────────────────────────────────────────────────────────────────────────────────────────────┘
<xarray.Dataset>
Dimensions:    (longitude: 1440, latitude: 721, level: 37, time: 8784)
Coordinates:
  * longitude  (longitude) float32 -180.0 -179.8 -179.5 ... 179.2 179.5 179.8
  * latitude   (latitude) float32 90.0 89.75 89.5 89.25 ... -89.5 -89.75 -90.0
  * level      (level) int32 1 2 3 5 7 10 20 30 ... 850 875 900 925 950 975 1000
  * time       (time) datetime64[ns] 1992-01-01 ... 1992-12-31T23:00:00
Data variables:
    u          (time, level, latitude, longitude) float32 dask.array<chunksize=(4, 37, 721, 1440), meta=np.ndarray>
Attributes:
    Conventions:  CF-1.6
    history:      2020-10-29 05:24:08 UTC+1100 by era5_replication_tools-1.2....
    license:      Licence to use Copernicus Products: https://apps.ecmwf.int/...
    summary:      ERA5 is the fifth generation ECMWF atmospheric reanalysis o...
    title:        ERA5 pressure-levels oper u_component_of_wind 19920101-1992...
━━━━━━━━━━━━━━━━━━━━━━━━━━━━━━━━━━━━━━━━━━━━━━━━━━━━━━━━━━━━━━━━━━━━━━━━━━━━━━━━━━━━━━━━━━━━━━━━━━━━━━━━━━━━━━━━━━━━━━━━━━


┌────────────────────────────────────────────────────────────────────────────────────────────────────────────────────────┐
┊                                                Sun Mar 19 21:35:06 2023                                                ┊
┊                rank ▻ 14                                                                                               ┊
┊                node ▻ gadi-cpu-clx-2524.gadi.nci.org.au                                                                ┊
┊                year ▻ 1993                                                                                             ┊
┊              in_dir ▻ /g/data/rt52/era5/pressure-levels/reanalysis/u/1993/*                                            ┊
┊            out_file ▻ /g/data/wb00/admin/testing/nci_5.625/u_component_of_wind/u_component_of_wind_1993_5.625.nc       ┊
└────────────────────────────────────────────────────────────────────────────────────────────────────────────────────────┘
<xarray.Dataset>
Dimensions:    (longitude: 1440, latitude: 721, level: 37, time: 8760)
Coordinates:
  * longitude  (longitude) float32 -180.0 -179.8 -179.5 ... 179.2 179.5 179.8
  * latitude   (latitude) float32 90.0 89.75 89.5 89.25 ... -89.5 -89.75 -90.0
  * level      (level) int32 1 2 3 5 7 10 20 30 ... 850 875 900 925 950 975 1000
  * time       (time) datetime64[ns] 1993-01-01 ... 1993-12-31T23:00:00
Data variables:
    u          (time, level, latitude, longitude) float32 dask.array<chunksize=(4, 37, 721, 1440), meta=np.ndarray>
Attributes:
    Conventions:  CF-1.6
    history:      2020-10-28 17:06:09 UTC+1100 by era5_replication_tools-1.2....
    license:      Licence to use Copernicus Products: https://apps.ecmwf.int/...
    summary:      ERA5 is the fifth generation ECMWF atmospheric reanalysis o...
    title:        ERA5 pressure-levels oper u_component_of_wind 19930101-1993...
━━━━━━━━━━━━━━━━━━━━━━━━━━━━━━━━━━━━━━━━━━━━━━━━━━━━━━━━━━━━━━━━━━━━━━━━━━━━━━━━━━━━━━━━━━━━━━━━━━━━━━━━━━━━━━━━━━━━━━━━━━


┌────────────────────────────────────────────────────────────────────────────────────────────────────────────────────────┐
┊                                                Sun Mar 19 21:35:08 2023                                                ┊
┊                rank ▻ 15                                                                                               ┊
┊                node ▻ gadi-cpu-clx-2524.gadi.nci.org.au                                                                ┊
┊                year ▻ 1994                                                                                             ┊
┊              in_dir ▻ /g/data/rt52/era5/pressure-levels/reanalysis/u/1994/*                                            ┊
┊            out_file ▻ /g/data/wb00/admin/testing/nci_5.625/u_component_of_wind/u_component_of_wind_1994_5.625.nc       ┊
└────────────────────────────────────────────────────────────────────────────────────────────────────────────────────────┘
<xarray.Dataset>
Dimensions:    (longitude: 1440, latitude: 721, level: 37, time: 8760)
Coordinates:
  * longitude  (longitude) float32 -180.0 -179.8 -179.5 ... 179.2 179.5 179.8
  * latitude   (latitude) float32 90.0 89.75 89.5 89.25 ... -89.5 -89.75 -90.0
  * level      (level) int32 1 2 3 5 7 10 20 30 ... 850 875 900 925 950 975 1000
  * time       (time) datetime64[ns] 1994-01-01 ... 1994-12-31T23:00:00
Data variables:
    u          (time, level, latitude, longitude) float32 dask.array<chunksize=(4, 37, 721, 1440), meta=np.ndarray>
Attributes:
    Conventions:  CF-1.6
    history:      2021-08-26 22:38:11 UTC+1000 by era5_replication_tools-1.9....
    license:      Licence to use Copernicus Products: https://apps.ecmwf.int/...
    summary:      ERA5 is the fifth generation ECMWF atmospheric reanalysis o...
    title:        ERA5 pressure-levels oper u_component_of_wind 19940101-1994...
━━━━━━━━━━━━━━━━━━━━━━━━━━━━━━━━━━━━━━━━━━━━━━━━━━━━━━━━━━━━━━━━━━━━━━━━━━━━━━━━━━━━━━━━━━━━━━━━━━━━━━━━━━━━━━━━━━━━━━━━━━


┌────────────────────────────────────────────────────────────────────────────────────────────────────────────────────────┐
┊                                                Sun Mar 19 21:35:12 2023                                                ┊
┊                rank ▻ 16                                                                                               ┊
┊                node ▻ gadi-cpu-clx-2525.gadi.nci.org.au                                                                ┊
┊                year ▻ 1995                                                                                             ┊
┊              in_dir ▻ /g/data/rt52/era5/pressure-levels/reanalysis/u/1995/*                                            ┊
┊            out_file ▻ /g/data/wb00/admin/testing/nci_5.625/u_component_of_wind/u_component_of_wind_1995_5.625.nc       ┊
└────────────────────────────────────────────────────────────────────────────────────────────────────────────────────────┘
<xarray.Dataset>
Dimensions:    (longitude: 1440, latitude: 721, level: 37, time: 8760)
Coordinates:
  * longitude  (longitude) float32 -180.0 -179.8 -179.5 ... 179.2 179.5 179.8
  * latitude   (latitude) float32 90.0 89.75 89.5 89.25 ... -89.5 -89.75 -90.0
  * level      (level) int32 1 2 3 5 7 10 20 30 ... 850 875 900 925 950 975 1000
  * time       (time) datetime64[ns] 1995-01-01 ... 1995-12-31T23:00:00
Data variables:
    u          (time, level, latitude, longitude) float32 dask.array<chunksize=(4, 37, 721, 1440), meta=np.ndarray>
Attributes:
    Conventions:  CF-1.6
    history:      2020-10-27 08:40:54 UTC+1100 by era5_replication_tools-1.2....
    license:      Licence to use Copernicus Products: https://apps.ecmwf.int/...
    summary:      ERA5 is the fifth generation ECMWF atmospheric reanalysis o...
    title:        ERA5 pressure-levels oper u_component_of_wind 19950101-1995...
━━━━━━━━━━━━━━━━━━━━━━━━━━━━━━━━━━━━━━━━━━━━━━━━━━━━━━━━━━━━━━━━━━━━━━━━━━━━━━━━━━━━━━━━━━━━━━━━━━━━━━━━━━━━━━━━━━━━━━━━━━


┌────────────────────────────────────────────────────────────────────────────────────────────────────────────────────────┐
┊                                                Sun Mar 19 21:35:14 2023                                                ┊
┊                rank ▻ 17                                                                                               ┊
┊                node ▻ gadi-cpu-clx-2525.gadi.nci.org.au                                                                ┊
┊                year ▻ 1996                                                                                             ┊
┊              in_dir ▻ /g/data/rt52/era5/pressure-levels/reanalysis/u/1996/*                                            ┊
┊            out_file ▻ /g/data/wb00/admin/testing/nci_5.625/u_component_of_wind/u_component_of_wind_1996_5.625.nc       ┊
└────────────────────────────────────────────────────────────────────────────────────────────────────────────────────────┘
<xarray.Dataset>
Dimensions:    (longitude: 1440, latitude: 721, level: 37, time: 8784)
Coordinates:
  * longitude  (longitude) float32 -180.0 -179.8 -179.5 ... 179.2 179.5 179.8
  * latitude   (latitude) float32 90.0 89.75 89.5 89.25 ... -89.5 -89.75 -90.0
  * level      (level) int32 1 2 3 5 7 10 20 30 ... 850 875 900 925 950 975 1000
  * time       (time) datetime64[ns] 1996-01-01 ... 1996-12-31T23:00:00
Data variables:
    u          (time, level, latitude, longitude) float32 dask.array<chunksize=(4, 37, 721, 1440), meta=np.ndarray>
Attributes:
    Conventions:  CF-1.6
    history:      2020-10-26 12:40:29 UTC+1100 by era5_replication_tools-1.2....
    license:      Licence to use Copernicus Products: https://apps.ecmwf.int/...
    summary:      ERA5 is the fifth generation ECMWF atmospheric reanalysis o...
    title:        ERA5 pressure-levels oper u_component_of_wind 19960101-1996...
━━━━━━━━━━━━━━━━━━━━━━━━━━━━━━━━━━━━━━━━━━━━━━━━━━━━━━━━━━━━━━━━━━━━━━━━━━━━━━━━━━━━━━━━━━━━━━━━━━━━━━━━━━━━━━━━━━━━━━━━━━


┌────────────────────────────────────────────────────────────────────────────────────────────────────────────────────────┐
┊                                                Sun Mar 19 21:35:16 2023                                                ┊
┊                rank ▻ 18                                                                                               ┊
┊                node ▻ gadi-cpu-clx-2525.gadi.nci.org.au                                                                ┊
┊                year ▻ 1997                                                                                             ┊
┊              in_dir ▻ /g/data/rt52/era5/pressure-levels/reanalysis/u/1997/*                                            ┊
┊            out_file ▻ /g/data/wb00/admin/testing/nci_5.625/u_component_of_wind/u_component_of_wind_1997_5.625.nc       ┊
└────────────────────────────────────────────────────────────────────────────────────────────────────────────────────────┘
<xarray.Dataset>
Dimensions:    (longitude: 1440, latitude: 721, level: 37, time: 8760)
Coordinates:
  * longitude  (longitude) float32 -180.0 -179.8 -179.5 ... 179.2 179.5 179.8
  * latitude   (latitude) float32 90.0 89.75 89.5 89.25 ... -89.5 -89.75 -90.0
  * level      (level) int32 1 2 3 5 7 10 20 30 ... 850 875 900 925 950 975 1000
  * time       (time) datetime64[ns] 1997-01-01 ... 1997-12-31T23:00:00
Data variables:
    u          (time, level, latitude, longitude) float32 dask.array<chunksize=(4, 37, 721, 1440), meta=np.ndarray>
Attributes:
    Conventions:  CF-1.6
    history:      2020-10-25 02:42:26 UTC+1100 by era5_replication_tools-1.2....
    license:      Licence to use Copernicus Products: https://apps.ecmwf.int/...
    summary:      ERA5 is the fifth generation ECMWF atmospheric reanalysis o...
    title:        ERA5 pressure-levels oper u_component_of_wind 19970101-1997...
━━━━━━━━━━━━━━━━━━━━━━━━━━━━━━━━━━━━━━━━━━━━━━━━━━━━━━━━━━━━━━━━━━━━━━━━━━━━━━━━━━━━━━━━━━━━━━━━━━━━━━━━━━━━━━━━━━━━━━━━━━


┌────────────────────────────────────────────────────────────────────────────────────────────────────────────────────────┐
┊                                                Sun Mar 19 21:35:18 2023                                                ┊
┊                rank ▻ 19                                                                                               ┊
┊                node ▻ gadi-cpu-clx-2525.gadi.nci.org.au                                                                ┊
┊                year ▻ 1998                                                                                             ┊
┊              in_dir ▻ /g/data/rt52/era5/pressure-levels/reanalysis/u/1998/*                                            ┊
┊            out_file ▻ /g/data/wb00/admin/testing/nci_5.625/u_component_of_wind/u_component_of_wind_1998_5.625.nc       ┊
└────────────────────────────────────────────────────────────────────────────────────────────────────────────────────────┘
<xarray.Dataset>
Dimensions:    (longitude: 1440, latitude: 721, level: 37, time: 8760)
Coordinates:
  * longitude  (longitude) float32 -180.0 -179.8 -179.5 ... 179.2 179.5 179.8
  * latitude   (latitude) float32 90.0 89.75 89.5 89.25 ... -89.5 -89.75 -90.0
  * level      (level) int32 1 2 3 5 7 10 20 30 ... 850 875 900 925 950 975 1000
  * time       (time) datetime64[ns] 1998-01-01 ... 1998-12-31T23:00:00
Data variables:
    u          (time, level, latitude, longitude) float32 dask.array<chunksize=(4, 37, 721, 1440), meta=np.ndarray>
Attributes:
    Conventions:  CF-1.6
    history:      2020-10-24 09:29:46 UTC+1100 by era5_replication_tools-1.2....
    license:      Licence to use Copernicus Products: https://apps.ecmwf.int/...
    summary:      ERA5 is the fifth generation ECMWF atmospheric reanalysis o...
    title:        ERA5 pressure-levels oper u_component_of_wind 19980101-1998...
━━━━━━━━━━━━━━━━━━━━━━━━━━━━━━━━━━━━━━━━━━━━━━━━━━━━━━━━━━━━━━━━━━━━━━━━━━━━━━━━━━━━━━━━━━━━━━━━━━━━━━━━━━━━━━━━━━━━━━━━━━


┌────────────────────────────────────────────────────────────────────────────────────────────────────────────────────────┐
┊                                                Sun Mar 19 21:35:20 2023                                                ┊
┊                rank ▻ 20                                                                                               ┊
┊                node ▻ gadi-cpu-clx-2526.gadi.nci.org.au                                                                ┊
┊                year ▻ 1999                                                                                             ┊
┊              in_dir ▻ /g/data/rt52/era5/pressure-levels/reanalysis/u/1999/*                                            ┊
┊            out_file ▻ /g/data/wb00/admin/testing/nci_5.625/u_component_of_wind/u_component_of_wind_1999_5.625.nc       ┊
└────────────────────────────────────────────────────────────────────────────────────────────────────────────────────────┘
<xarray.Dataset>
Dimensions:    (longitude: 1440, latitude: 721, level: 37, time: 8760)
Coordinates:
  * longitude  (longitude) float32 -180.0 -179.8 -179.5 ... 179.2 179.5 179.8
  * latitude   (latitude) float32 90.0 89.75 89.5 89.25 ... -89.5 -89.75 -90.0
  * level      (level) int32 1 2 3 5 7 10 20 30 ... 850 875 900 925 950 975 1000
  * time       (time) datetime64[ns] 1999-01-01 ... 1999-12-31T23:00:00
Data variables:
    u          (time, level, latitude, longitude) float32 dask.array<chunksize=(4, 37, 721, 1440), meta=np.ndarray>
Attributes:
    Conventions:  CF-1.6
    history:      2020-10-23 15:55:33 UTC+1100 by era5_replication_tools-1.2....
    license:      Licence to use Copernicus Products: https://apps.ecmwf.int/...
    summary:      ERA5 is the fifth generation ECMWF atmospheric reanalysis o...
    title:        ERA5 pressure-levels oper u_component_of_wind 19990101-1999...
━━━━━━━━━━━━━━━━━━━━━━━━━━━━━━━━━━━━━━━━━━━━━━━━━━━━━━━━━━━━━━━━━━━━━━━━━━━━━━━━━━━━━━━━━━━━━━━━━━━━━━━━━━━━━━━━━━━━━━━━━━


┌────────────────────────────────────────────────────────────────────────────────────────────────────────────────────────┐
┊                                                Sun Mar 19 21:35:22 2023                                                ┊
┊                rank ▻ 21                                                                                               ┊
┊                node ▻ gadi-cpu-clx-2526.gadi.nci.org.au                                                                ┊
┊                year ▻ 2000                                                                                             ┊
┊              in_dir ▻ /g/data/rt52/era5/pressure-levels/reanalysis/u/2000/*                                            ┊
┊            out_file ▻ /g/data/wb00/admin/testing/nci_5.625/u_component_of_wind/u_component_of_wind_2000_5.625.nc       ┊
└────────────────────────────────────────────────────────────────────────────────────────────────────────────────────────┘
<xarray.Dataset>
Dimensions:    (longitude: 1440, latitude: 721, level: 37, time: 8784)
Coordinates:
  * longitude  (longitude) float32 -180.0 -179.8 -179.5 ... 179.2 179.5 179.8
  * latitude   (latitude) float32 90.0 89.75 89.5 89.25 ... -89.5 -89.75 -90.0
  * level      (level) int32 1 2 3 5 7 10 20 30 ... 850 875 900 925 950 975 1000
  * time       (time) datetime64[ns] 2000-01-01 ... 2000-12-31T23:00:00
Data variables:
    u          (time, level, latitude, longitude) float32 dask.array<chunksize=(4, 37, 721, 1440), meta=np.ndarray>
Attributes:
    Conventions:  CF-1.6
    license:      Licence to use Copernicus Products: https://apps.ecmwf.int/...
    summary:      ERA5 is the fifth generation ECMWF atmospheric reanalysis o...
    title:        ERA5 pressure-levels oper u_component_of_wind 20000101-2000...
    history:      2021-01-08 07:37:21 UTC+1100 by era5_replication_tools-1.8....
━━━━━━━━━━━━━━━━━━━━━━━━━━━━━━━━━━━━━━━━━━━━━━━━━━━━━━━━━━━━━━━━━━━━━━━━━━━━━━━━━━━━━━━━━━━━━━━━━━━━━━━━━━━━━━━━━━━━━━━━━━


┌────────────────────────────────────────────────────────────────────────────────────────────────────────────────────────┐
┊                                                Sun Mar 19 21:35:24 2023                                                ┊
┊                rank ▻ 22                                                                                               ┊
┊                node ▻ gadi-cpu-clx-2526.gadi.nci.org.au                                                                ┊
┊                year ▻ 2001                                                                                             ┊
┊              in_dir ▻ /g/data/rt52/era5/pressure-levels/reanalysis/u/2001/*                                            ┊
┊            out_file ▻ /g/data/wb00/admin/testing/nci_5.625/u_component_of_wind/u_component_of_wind_2001_5.625.nc       ┊
└────────────────────────────────────────────────────────────────────────────────────────────────────────────────────────┘
<xarray.Dataset>
Dimensions:    (longitude: 1440, latitude: 721, level: 37, time: 8760)
Coordinates:
  * longitude  (longitude) float32 -180.0 -179.8 -179.5 ... 179.2 179.5 179.8
  * latitude   (latitude) float32 90.0 89.75 89.5 89.25 ... -89.5 -89.75 -90.0
  * level      (level) int32 1 2 3 5 7 10 20 30 ... 850 875 900 925 950 975 1000
  * time       (time) datetime64[ns] 2001-01-01 ... 2001-12-31T23:00:00
Data variables:
    u          (time, level, latitude, longitude) float32 dask.array<chunksize=(4, 37, 721, 1440), meta=np.ndarray>
Attributes:
    Conventions:  CF-1.6
    license:      Licence to use Copernicus Products: https://apps.ecmwf.int/...
    summary:      ERA5 is the fifth generation ECMWF atmospheric reanalysis o...
    title:        ERA5 pressure-levels oper u_component_of_wind 20010101-2001...
    history:      2021-01-08 07:37:32 UTC+1100 by era5_replication_tools-1.8....
━━━━━━━━━━━━━━━━━━━━━━━━━━━━━━━━━━━━━━━━━━━━━━━━━━━━━━━━━━━━━━━━━━━━━━━━━━━━━━━━━━━━━━━━━━━━━━━━━━━━━━━━━━━━━━━━━━━━━━━━━━


┌────────────────────────────────────────────────────────────────────────────────────────────────────────────────────────┐
┊                                                Sun Mar 19 21:35:26 2023                                                ┊
┊                rank ▻ 23                                                                                               ┊
┊                node ▻ gadi-cpu-clx-2526.gadi.nci.org.au                                                                ┊
┊                year ▻ 2002                                                                                             ┊
┊              in_dir ▻ /g/data/rt52/era5/pressure-levels/reanalysis/u/2002/*                                            ┊
┊            out_file ▻ /g/data/wb00/admin/testing/nci_5.625/u_component_of_wind/u_component_of_wind_2002_5.625.nc       ┊
└────────────────────────────────────────────────────────────────────────────────────────────────────────────────────────┘
<xarray.Dataset>
Dimensions:    (longitude: 1440, latitude: 721, level: 37, time: 8760)
Coordinates:
  * longitude  (longitude) float32 -180.0 -179.8 -179.5 ... 179.2 179.5 179.8
  * latitude   (latitude) float32 90.0 89.75 89.5 89.25 ... -89.5 -89.75 -90.0
  * level      (level) int32 1 2 3 5 7 10 20 30 ... 850 875 900 925 950 975 1000
  * time       (time) datetime64[ns] 2002-01-01 ... 2002-12-31T23:00:00
Data variables:
    u          (time, level, latitude, longitude) float32 dask.array<chunksize=(4, 37, 721, 1440), meta=np.ndarray>
Attributes:
    Conventions:  CF-1.6
    history:      2020-11-11 00:01:37 UTC+1100 by era5_replication_tools-1.2....
    license:      Licence to use Copernicus Products: https://apps.ecmwf.int/...
    summary:      ERA5 is the fifth generation ECMWF atmospheric reanalysis o...
    title:        ERA5 pressure-levels oper u_component_of_wind 20020101-2002...
━━━━━━━━━━━━━━━━━━━━━━━━━━━━━━━━━━━━━━━━━━━━━━━━━━━━━━━━━━━━━━━━━━━━━━━━━━━━━━━━━━━━━━━━━━━━━━━━━━━━━━━━━━━━━━━━━━━━━━━━━━


┌────────────────────────────────────────────────────────────────────────────────────────────────────────────────────────┐
┊                                                Sun Mar 19 21:35:26 2023                                                ┊
┊                rank ▻ 24                                                                                               ┊
┊                node ▻ gadi-cpu-clx-2527.gadi.nci.org.au                                                                ┊
┊                year ▻ 2003                                                                                             ┊
┊              in_dir ▻ /g/data/rt52/era5/pressure-levels/reanalysis/u/2003/*                                            ┊
┊            out_file ▻ /g/data/wb00/admin/testing/nci_5.625/u_component_of_wind/u_component_of_wind_2003_5.625.nc       ┊
└────────────────────────────────────────────────────────────────────────────────────────────────────────────────────────┘
<xarray.Dataset>
Dimensions:    (longitude: 1440, latitude: 721, level: 37, time: 8760)
Coordinates:
  * longitude  (longitude) float32 -180.0 -179.8 -179.5 ... 179.2 179.5 179.8
  * latitude   (latitude) float32 90.0 89.75 89.5 89.25 ... -89.5 -89.75 -90.0
  * level      (level) int32 1 2 3 5 7 10 20 30 ... 850 875 900 925 950 975 1000
  * time       (time) datetime64[ns] 2003-01-01 ... 2003-12-31T23:00:00
Data variables:
    u          (time, level, latitude, longitude) float32 dask.array<chunksize=(4, 37, 721, 1440), meta=np.ndarray>
Attributes:
    Conventions:  CF-1.6
    history:      2020-11-10 02:07:09 UTC+1100 by era5_replication_tools-1.2....
    license:      Licence to use Copernicus Products: https://apps.ecmwf.int/...
    summary:      ERA5 is the fifth generation ECMWF atmospheric reanalysis o...
    title:        ERA5 pressure-levels oper u_component_of_wind 20030101-2003...
━━━━━━━━━━━━━━━━━━━━━━━━━━━━━━━━━━━━━━━━━━━━━━━━━━━━━━━━━━━━━━━━━━━━━━━━━━━━━━━━━━━━━━━━━━━━━━━━━━━━━━━━━━━━━━━━━━━━━━━━━━


┌────────────────────────────────────────────────────────────────────────────────────────────────────────────────────────┐
┊                                                Sun Mar 19 21:35:28 2023                                                ┊
┊                rank ▻ 25                                                                                               ┊
┊                node ▻ gadi-cpu-clx-2527.gadi.nci.org.au                                                                ┊
┊                year ▻ 2004                                                                                             ┊
┊              in_dir ▻ /g/data/rt52/era5/pressure-levels/reanalysis/u/2004/*                                            ┊
┊            out_file ▻ /g/data/wb00/admin/testing/nci_5.625/u_component_of_wind/u_component_of_wind_2004_5.625.nc       ┊
└────────────────────────────────────────────────────────────────────────────────────────────────────────────────────────┘
<xarray.Dataset>
Dimensions:    (longitude: 1440, latitude: 721, level: 37, time: 8784)
Coordinates:
  * longitude  (longitude) float32 -180.0 -179.8 -179.5 ... 179.2 179.5 179.8
  * latitude   (latitude) float32 90.0 89.75 89.5 89.25 ... -89.5 -89.75 -90.0
  * level      (level) int32 1 2 3 5 7 10 20 30 ... 850 875 900 925 950 975 1000
  * time       (time) datetime64[ns] 2004-01-01 ... 2004-12-31T23:00:00
Data variables:
    u          (time, level, latitude, longitude) float32 dask.array<chunksize=(4, 37, 721, 1440), meta=np.ndarray>
Attributes:
    Conventions:  CF-1.6
    history:      2020-11-09 09:13:23 UTC+1100 by era5_replication_tools-1.2....
    license:      Licence to use Copernicus Products: https://apps.ecmwf.int/...
    summary:      ERA5 is the fifth generation ECMWF atmospheric reanalysis o...
    title:        ERA5 pressure-levels oper u_component_of_wind 20040101-2004...
━━━━━━━━━━━━━━━━━━━━━━━━━━━━━━━━━━━━━━━━━━━━━━━━━━━━━━━━━━━━━━━━━━━━━━━━━━━━━━━━━━━━━━━━━━━━━━━━━━━━━━━━━━━━━━━━━━━━━━━━━━


┌────────────────────────────────────────────────────────────────────────────────────────────────────────────────────────┐
┊                                                Sun Mar 19 21:35:30 2023                                                ┊
┊                rank ▻ 26                                                                                               ┊
┊                node ▻ gadi-cpu-clx-2527.gadi.nci.org.au                                                                ┊
┊                year ▻ 2005                                                                                             ┊
┊              in_dir ▻ /g/data/rt52/era5/pressure-levels/reanalysis/u/2005/*                                            ┊
┊            out_file ▻ /g/data/wb00/admin/testing/nci_5.625/u_component_of_wind/u_component_of_wind_2005_5.625.nc       ┊
└────────────────────────────────────────────────────────────────────────────────────────────────────────────────────────┘
<xarray.Dataset>
Dimensions:    (longitude: 1440, latitude: 721, level: 37, time: 8760)
Coordinates:
  * longitude  (longitude) float32 -180.0 -179.8 -179.5 ... 179.2 179.5 179.8
  * latitude   (latitude) float32 90.0 89.75 89.5 89.25 ... -89.5 -89.75 -90.0
  * level      (level) int32 1 2 3 5 7 10 20 30 ... 850 875 900 925 950 975 1000
  * time       (time) datetime64[ns] 2005-01-01 ... 2005-12-31T23:00:00
Data variables:
    u          (time, level, latitude, longitude) float32 dask.array<chunksize=(4, 37, 721, 1440), meta=np.ndarray>
Attributes:
    Conventions:  CF-1.6
    history:      2020-11-08 19:22:53 UTC+1100 by era5_replication_tools-1.2....
    license:      Licence to use Copernicus Products: https://apps.ecmwf.int/...
    summary:      ERA5 is the fifth generation ECMWF atmospheric reanalysis o...
    title:        ERA5 pressure-levels oper u_component_of_wind 20050101-2005...
━━━━━━━━━━━━━━━━━━━━━━━━━━━━━━━━━━━━━━━━━━━━━━━━━━━━━━━━━━━━━━━━━━━━━━━━━━━━━━━━━━━━━━━━━━━━━━━━━━━━━━━━━━━━━━━━━━━━━━━━━━


┌────────────────────────────────────────────────────────────────────────────────────────────────────────────────────────┐
┊                                                Sun Mar 19 21:35:32 2023                                                ┊
┊                rank ▻ 27                                                                                               ┊
┊                node ▻ gadi-cpu-clx-2527.gadi.nci.org.au                                                                ┊
┊                year ▻ 2006                                                                                             ┊
┊              in_dir ▻ /g/data/rt52/era5/pressure-levels/reanalysis/u/2006/*                                            ┊
┊            out_file ▻ /g/data/wb00/admin/testing/nci_5.625/u_component_of_wind/u_component_of_wind_2006_5.625.nc       ┊
└────────────────────────────────────────────────────────────────────────────────────────────────────────────────────────┘
<xarray.Dataset>
Dimensions:    (longitude: 1440, latitude: 721, level: 37, time: 8760)
Coordinates:
  * longitude  (longitude) float32 -180.0 -179.8 -179.5 ... 179.2 179.5 179.8
  * latitude   (latitude) float32 90.0 89.75 89.5 89.25 ... -89.5 -89.75 -90.0
  * level      (level) int32 1 2 3 5 7 10 20 30 ... 850 875 900 925 950 975 1000
  * time       (time) datetime64[ns] 2006-01-01 ... 2006-12-31T23:00:00
Data variables:
    u          (time, level, latitude, longitude) float32 dask.array<chunksize=(4, 37, 721, 1440), meta=np.ndarray>
Attributes:
    Conventions:  CF-1.6
    history:      2020-11-08 02:55:43 UTC+1100 by era5_replication_tools-1.2....
    license:      Licence to use Copernicus Products: https://apps.ecmwf.int/...
    summary:      ERA5 is the fifth generation ECMWF atmospheric reanalysis o...
    title:        ERA5 pressure-levels oper u_component_of_wind 20060101-2006...
━━━━━━━━━━━━━━━━━━━━━━━━━━━━━━━━━━━━━━━━━━━━━━━━━━━━━━━━━━━━━━━━━━━━━━━━━━━━━━━━━━━━━━━━━━━━━━━━━━━━━━━━━━━━━━━━━━━━━━━━━━


┌────────────────────────────────────────────────────────────────────────────────────────────────────────────────────────┐
┊                                                Sun Mar 19 21:35:35 2023                                                ┊
┊                rank ▻ 28                                                                                               ┊
┊                node ▻ gadi-cpu-clx-2528.gadi.nci.org.au                                                                ┊
┊                year ▻ 2007                                                                                             ┊
┊              in_dir ▻ /g/data/rt52/era5/pressure-levels/reanalysis/u/2007/*                                            ┊
┊            out_file ▻ /g/data/wb00/admin/testing/nci_5.625/u_component_of_wind/u_component_of_wind_2007_5.625.nc       ┊
└────────────────────────────────────────────────────────────────────────────────────────────────────────────────────────┘
<xarray.Dataset>
Dimensions:    (longitude: 1440, latitude: 721, level: 37, time: 8760)
Coordinates:
  * longitude  (longitude) float32 -180.0 -179.8 -179.5 ... 179.2 179.5 179.8
  * latitude   (latitude) float32 90.0 89.75 89.5 89.25 ... -89.5 -89.75 -90.0
  * level      (level) int32 1 2 3 5 7 10 20 30 ... 850 875 900 925 950 975 1000
  * time       (time) datetime64[ns] 2007-01-01 ... 2007-12-31T23:00:00
Data variables:
    u          (time, level, latitude, longitude) float32 dask.array<chunksize=(4, 37, 721, 1440), meta=np.ndarray>
Attributes:
    Conventions:  CF-1.6
    history:      2020-10-22 22:11:54 UTC+1100 by era5_replication_tools-1.2....
    license:      Licence to use Copernicus Products: https://apps.ecmwf.int/...
    summary:      ERA5 is the fifth generation ECMWF atmospheric reanalysis o...
    title:        ERA5 pressure-levels oper u_component_of_wind 20070101-2007...
━━━━━━━━━━━━━━━━━━━━━━━━━━━━━━━━━━━━━━━━━━━━━━━━━━━━━━━━━━━━━━━━━━━━━━━━━━━━━━━━━━━━━━━━━━━━━━━━━━━━━━━━━━━━━━━━━━━━━━━━━━


┌────────────────────────────────────────────────────────────────────────────────────────────────────────────────────────┐
┊                                                Sun Mar 19 21:35:37 2023                                                ┊
┊                rank ▻ 29                                                                                               ┊
┊                node ▻ gadi-cpu-clx-2528.gadi.nci.org.au                                                                ┊
┊                year ▻ 2008                                                                                             ┊
┊              in_dir ▻ /g/data/rt52/era5/pressure-levels/reanalysis/u/2008/*                                            ┊
┊            out_file ▻ /g/data/wb00/admin/testing/nci_5.625/u_component_of_wind/u_component_of_wind_2008_5.625.nc       ┊
└────────────────────────────────────────────────────────────────────────────────────────────────────────────────────────┘
<xarray.Dataset>
Dimensions:    (longitude: 1440, latitude: 721, level: 37, time: 8784)
Coordinates:
  * longitude  (longitude) float32 -180.0 -179.8 -179.5 ... 179.2 179.5 179.8
  * latitude   (latitude) float32 90.0 89.75 89.5 89.25 ... -89.5 -89.75 -90.0
  * level      (level) int32 1 2 3 5 7 10 20 30 ... 850 875 900 925 950 975 1000
  * time       (time) datetime64[ns] 2008-01-01 ... 2008-12-31T23:00:00
Data variables:
    u          (time, level, latitude, longitude) float32 dask.array<chunksize=(4, 37, 721, 1440), meta=np.ndarray>
Attributes:
    Conventions:  CF-1.6
    history:      2020-11-25 21:04:24 UTC+1100 by era5_replication_tools-1.8....
    license:      Licence to use Copernicus Products: https://apps.ecmwf.int/...
    summary:      ERA5 is the fifth generation ECMWF atmospheric reanalysis o...
    title:        ERA5 pressure-levels oper u_component_of_wind 20080101-2008...
━━━━━━━━━━━━━━━━━━━━━━━━━━━━━━━━━━━━━━━━━━━━━━━━━━━━━━━━━━━━━━━━━━━━━━━━━━━━━━━━━━━━━━━━━━━━━━━━━━━━━━━━━━━━━━━━━━━━━━━━━━


┌────────────────────────────────────────────────────────────────────────────────────────────────────────────────────────┐
┊                                                Sun Mar 19 21:35:39 2023                                                ┊
┊                rank ▻ 30                                                                                               ┊
┊                node ▻ gadi-cpu-clx-2528.gadi.nci.org.au                                                                ┊
┊                year ▻ 2009                                                                                             ┊
┊              in_dir ▻ /g/data/rt52/era5/pressure-levels/reanalysis/u/2009/*                                            ┊
┊            out_file ▻ /g/data/wb00/admin/testing/nci_5.625/u_component_of_wind/u_component_of_wind_2009_5.625.nc       ┊
└────────────────────────────────────────────────────────────────────────────────────────────────────────────────────────┘
<xarray.Dataset>
Dimensions:    (longitude: 1440, latitude: 721, level: 37, time: 8760)
Coordinates:
  * longitude  (longitude) float32 -180.0 -179.8 -179.5 ... 179.2 179.5 179.8
  * latitude   (latitude) float32 90.0 89.75 89.5 89.25 ... -89.5 -89.75 -90.0
  * level      (level) int32 1 2 3 5 7 10 20 30 ... 850 875 900 925 950 975 1000
  * time       (time) datetime64[ns] 2009-01-01 ... 2009-12-31T23:00:00
Data variables:
    u          (time, level, latitude, longitude) float32 dask.array<chunksize=(4, 37, 721, 1440), meta=np.ndarray>
Attributes:
    Conventions:  CF-1.6
    history:      2020-11-25 07:51:55 UTC+1100 by era5_replication_tools-1.8....
    license:      Licence to use Copernicus Products: https://apps.ecmwf.int/...
    summary:      ERA5 is the fifth generation ECMWF atmospheric reanalysis o...
    title:        ERA5 pressure-levels oper u_component_of_wind 20090101-2009...
━━━━━━━━━━━━━━━━━━━━━━━━━━━━━━━━━━━━━━━━━━━━━━━━━━━━━━━━━━━━━━━━━━━━━━━━━━━━━━━━━━━━━━━━━━━━━━━━━━━━━━━━━━━━━━━━━━━━━━━━━━


┌────────────────────────────────────────────────────────────────────────────────────────────────────────────────────────┐
┊                                                Sun Mar 19 21:35:41 2023                                                ┊
┊                rank ▻ 31                                                                                               ┊
┊                node ▻ gadi-cpu-clx-2528.gadi.nci.org.au                                                                ┊
┊                year ▻ 2010                                                                                             ┊
┊              in_dir ▻ /g/data/rt52/era5/pressure-levels/reanalysis/u/2010/*                                            ┊
┊            out_file ▻ /g/data/wb00/admin/testing/nci_5.625/u_component_of_wind/u_component_of_wind_2010_5.625.nc       ┊
└────────────────────────────────────────────────────────────────────────────────────────────────────────────────────────┘
<xarray.Dataset>
Dimensions:    (longitude: 1440, latitude: 721, level: 37, time: 8760)
Coordinates:
  * longitude  (longitude) float32 -180.0 -179.8 -179.5 ... 179.2 179.5 179.8
  * latitude   (latitude) float32 90.0 89.75 89.5 89.25 ... -89.5 -89.75 -90.0
  * level      (level) int32 1 2 3 5 7 10 20 30 ... 850 875 900 925 950 975 1000
  * time       (time) datetime64[ns] 2010-01-01 ... 2010-12-31T23:00:00
Data variables:
    u          (time, level, latitude, longitude) float32 dask.array<chunksize=(4, 37, 721, 1440), meta=np.ndarray>
Attributes:
    Conventions:  CF-1.6
    history:      2020-11-24 19:30:11 UTC+1100 by era5_replication_tools-1.8....
    license:      Licence to use Copernicus Products: https://apps.ecmwf.int/...
    summary:      ERA5 is the fifth generation ECMWF atmospheric reanalysis o...
    title:        ERA5 pressure-levels oper u_component_of_wind 20100101-2010...
━━━━━━━━━━━━━━━━━━━━━━━━━━━━━━━━━━━━━━━━━━━━━━━━━━━━━━━━━━━━━━━━━━━━━━━━━━━━━━━━━━━━━━━━━━━━━━━━━━━━━━━━━━━━━━━━━━━━━━━━━━


┌────────────────────────────────────────────────────────────────────────────────────────────────────────────────────────┐
┊                                                Sun Mar 19 21:35:44 2023                                                ┊
┊                rank ▻ 32                                                                                               ┊
┊                node ▻ gadi-cpu-clx-2529.gadi.nci.org.au                                                                ┊
┊                year ▻ 2011                                                                                             ┊
┊              in_dir ▻ /g/data/rt52/era5/pressure-levels/reanalysis/u/2011/*                                            ┊
┊            out_file ▻ /g/data/wb00/admin/testing/nci_5.625/u_component_of_wind/u_component_of_wind_2011_5.625.nc       ┊
└────────────────────────────────────────────────────────────────────────────────────────────────────────────────────────┘
<xarray.Dataset>
Dimensions:    (longitude: 1440, latitude: 721, level: 37, time: 8760)
Coordinates:
  * longitude  (longitude) float32 -180.0 -179.8 -179.5 ... 179.2 179.5 179.8
  * latitude   (latitude) float32 90.0 89.75 89.5 89.25 ... -89.5 -89.75 -90.0
  * level      (level) int32 1 2 3 5 7 10 20 30 ... 850 875 900 925 950 975 1000
  * time       (time) datetime64[ns] 2011-01-01 ... 2011-12-31T23:00:00
Data variables:
    u          (time, level, latitude, longitude) float32 dask.array<chunksize=(4, 37, 721, 1440), meta=np.ndarray>
Attributes:
    Conventions:  CF-1.6
    history:      2020-11-24 05:21:35 UTC+1100 by era5_replication_tools-1.8....
    license:      Licence to use Copernicus Products: https://apps.ecmwf.int/...
    summary:      ERA5 is the fifth generation ECMWF atmospheric reanalysis o...
    title:        ERA5 pressure-levels oper u_component_of_wind 20110101-2011...
━━━━━━━━━━━━━━━━━━━━━━━━━━━━━━━━━━━━━━━━━━━━━━━━━━━━━━━━━━━━━━━━━━━━━━━━━━━━━━━━━━━━━━━━━━━━━━━━━━━━━━━━━━━━━━━━━━━━━━━━━━


┌────────────────────────────────────────────────────────────────────────────────────────────────────────────────────────┐
┊                                                Sun Mar 19 21:35:46 2023                                                ┊
┊                rank ▻ 33                                                                                               ┊
┊                node ▻ gadi-cpu-clx-2529.gadi.nci.org.au                                                                ┊
┊                year ▻ 2012                                                                                             ┊
┊              in_dir ▻ /g/data/rt52/era5/pressure-levels/reanalysis/u/2012/*                                            ┊
┊            out_file ▻ /g/data/wb00/admin/testing/nci_5.625/u_component_of_wind/u_component_of_wind_2012_5.625.nc       ┊
└────────────────────────────────────────────────────────────────────────────────────────────────────────────────────────┘
<xarray.Dataset>
Dimensions:    (longitude: 1440, latitude: 721, level: 37, time: 8784)
Coordinates:
  * longitude  (longitude) float32 -180.0 -179.8 -179.5 ... 179.2 179.5 179.8
  * latitude   (latitude) float32 90.0 89.75 89.5 89.25 ... -89.5 -89.75 -90.0
  * level      (level) int32 1 2 3 5 7 10 20 30 ... 850 875 900 925 950 975 1000
  * time       (time) datetime64[ns] 2012-01-01 ... 2012-12-31T23:00:00
Data variables:
    u          (time, level, latitude, longitude) float32 dask.array<chunksize=(4, 37, 721, 1440), meta=np.ndarray>
Attributes:
    Conventions:  CF-1.6
    history:      2020-11-23 15:15:35 UTC+1100 by era5_replication_tools-1.8....
    license:      Licence to use Copernicus Products: https://apps.ecmwf.int/...
    summary:      ERA5 is the fifth generation ECMWF atmospheric reanalysis o...
    title:        ERA5 pressure-levels oper u_component_of_wind 20120101-2012...
━━━━━━━━━━━━━━━━━━━━━━━━━━━━━━━━━━━━━━━━━━━━━━━━━━━━━━━━━━━━━━━━━━━━━━━━━━━━━━━━━━━━━━━━━━━━━━━━━━━━━━━━━━━━━━━━━━━━━━━━━━


┌────────────────────────────────────────────────────────────────────────────────────────────────────────────────────────┐
┊                                                Sun Mar 19 21:35:48 2023                                                ┊
┊                rank ▻ 34                                                                                               ┊
┊                node ▻ gadi-cpu-clx-2529.gadi.nci.org.au                                                                ┊
┊                year ▻ 2013                                                                                             ┊
┊              in_dir ▻ /g/data/rt52/era5/pressure-levels/reanalysis/u/2013/*                                            ┊
┊            out_file ▻ /g/data/wb00/admin/testing/nci_5.625/u_component_of_wind/u_component_of_wind_2013_5.625.nc       ┊
└────────────────────────────────────────────────────────────────────────────────────────────────────────────────────────┘
<xarray.Dataset>
Dimensions:    (longitude: 1440, latitude: 721, level: 37, time: 8760)
Coordinates:
  * longitude  (longitude) float32 -180.0 -179.8 -179.5 ... 179.2 179.5 179.8
  * latitude   (latitude) float32 90.0 89.75 89.5 89.25 ... -89.5 -89.75 -90.0
  * level      (level) int32 1 2 3 5 7 10 20 30 ... 850 875 900 925 950 975 1000
  * time       (time) datetime64[ns] 2013-01-01 ... 2013-12-31T23:00:00
Data variables:
    u          (time, level, latitude, longitude) float32 dask.array<chunksize=(4, 37, 721, 1440), meta=np.ndarray>
Attributes:
    Conventions:  CF-1.6
    history:      2020-11-22 18:34:38 UTC+1100 by era5_replication_tools-1.7....
    license:      Licence to use Copernicus Products: https://apps.ecmwf.int/...
    summary:      ERA5 is the fifth generation ECMWF atmospheric reanalysis o...
    title:        ERA5 pressure-levels oper u_component_of_wind 20130101-2013...
━━━━━━━━━━━━━━━━━━━━━━━━━━━━━━━━━━━━━━━━━━━━━━━━━━━━━━━━━━━━━━━━━━━━━━━━━━━━━━━━━━━━━━━━━━━━━━━━━━━━━━━━━━━━━━━━━━━━━━━━━━


┌────────────────────────────────────────────────────────────────────────────────────────────────────────────────────────┐
┊                                                Sun Mar 19 21:35:50 2023                                                ┊
┊                rank ▻ 35                                                                                               ┊
┊                node ▻ gadi-cpu-clx-2529.gadi.nci.org.au                                                                ┊
┊                year ▻ 2014                                                                                             ┊
┊              in_dir ▻ /g/data/rt52/era5/pressure-levels/reanalysis/u/2014/*                                            ┊
┊            out_file ▻ /g/data/wb00/admin/testing/nci_5.625/u_component_of_wind/u_component_of_wind_2014_5.625.nc       ┊
└────────────────────────────────────────────────────────────────────────────────────────────────────────────────────────┘
<xarray.Dataset>
Dimensions:    (longitude: 1440, latitude: 721, level: 37, time: 8760)
Coordinates:
  * longitude  (longitude) float32 -180.0 -179.8 -179.5 ... 179.2 179.5 179.8
  * latitude   (latitude) float32 90.0 89.75 89.5 89.25 ... -89.5 -89.75 -90.0
  * level      (level) int32 1 2 3 5 7 10 20 30 ... 850 875 900 925 950 975 1000
  * time       (time) datetime64[ns] 2014-01-01 ... 2014-12-31T23:00:00
Data variables:
    u          (time, level, latitude, longitude) float32 dask.array<chunksize=(4, 37, 721, 1440), meta=np.ndarray>
Attributes:
    Conventions:  CF-1.6
    history:      2020-11-22 00:23:30 UTC+1100 by era5_replication_tools-1.7....
    license:      Licence to use Copernicus Products: https://apps.ecmwf.int/...
    summary:      ERA5 is the fifth generation ECMWF atmospheric reanalysis o...
    title:        ERA5 pressure-levels oper u_component_of_wind 20140101-2014...
━━━━━━━━━━━━━━━━━━━━━━━━━━━━━━━━━━━━━━━━━━━━━━━━━━━━━━━━━━━━━━━━━━━━━━━━━━━━━━━━━━━━━━━━━━━━━━━━━━━━━━━━━━━━━━━━━━━━━━━━━━


┌────────────────────────────────────────────────────────────────────────────────────────────────────────────────────────┐
┊                                                Sun Mar 19 21:35:53 2023                                                ┊
┊                rank ▻ 36                                                                                               ┊
┊                node ▻ gadi-cpu-clx-2530.gadi.nci.org.au                                                                ┊
┊                year ▻ 2015                                                                                             ┊
┊              in_dir ▻ /g/data/rt52/era5/pressure-levels/reanalysis/u/2015/*                                            ┊
┊            out_file ▻ /g/data/wb00/admin/testing/nci_5.625/u_component_of_wind/u_component_of_wind_2015_5.625.nc       ┊
└────────────────────────────────────────────────────────────────────────────────────────────────────────────────────────┘
<xarray.Dataset>
Dimensions:    (longitude: 1440, latitude: 721, level: 37, time: 8760)
Coordinates:
  * longitude  (longitude) float32 -180.0 -179.8 -179.5 ... 179.2 179.5 179.8
  * latitude   (latitude) float32 90.0 89.75 89.5 89.25 ... -89.5 -89.75 -90.0
  * level      (level) int32 1 2 3 5 7 10 20 30 ... 850 875 900 925 950 975 1000
  * time       (time) datetime64[ns] 2015-01-01 ... 2015-12-31T23:00:00
Data variables:
    u          (time, level, latitude, longitude) float32 dask.array<chunksize=(4, 37, 721, 1440), meta=np.ndarray>
Attributes:
    Conventions:  CF-1.6
    history:      2020-11-21 01:49:46 UTC+1100 by era5_replication_tools-1.7....
    license:      Licence to use Copernicus Products: https://apps.ecmwf.int/...
    summary:      ERA5 is the fifth generation ECMWF atmospheric reanalysis o...
    title:        ERA5 pressure-levels oper u_component_of_wind 20150101-2015...
━━━━━━━━━━━━━━━━━━━━━━━━━━━━━━━━━━━━━━━━━━━━━━━━━━━━━━━━━━━━━━━━━━━━━━━━━━━━━━━━━━━━━━━━━━━━━━━━━━━━━━━━━━━━━━━━━━━━━━━━━━


┌────────────────────────────────────────────────────────────────────────────────────────────────────────────────────────┐
┊                                                Sun Mar 19 21:35:55 2023                                                ┊
┊                rank ▻ 37                                                                                               ┊
┊                node ▻ gadi-cpu-clx-2530.gadi.nci.org.au                                                                ┊
┊                year ▻ 2016                                                                                             ┊
┊              in_dir ▻ /g/data/rt52/era5/pressure-levels/reanalysis/u/2016/*                                            ┊
┊            out_file ▻ /g/data/wb00/admin/testing/nci_5.625/u_component_of_wind/u_component_of_wind_2016_5.625.nc       ┊
└────────────────────────────────────────────────────────────────────────────────────────────────────────────────────────┘
<xarray.Dataset>
Dimensions:    (longitude: 1440, latitude: 721, level: 37, time: 8784)
Coordinates:
  * longitude  (longitude) float32 -180.0 -179.8 -179.5 ... 179.2 179.5 179.8
  * latitude   (latitude) float32 90.0 89.75 89.5 89.25 ... -89.5 -89.75 -90.0
  * level      (level) int32 1 2 3 5 7 10 20 30 ... 850 875 900 925 950 975 1000
  * time       (time) datetime64[ns] 2016-01-01 ... 2016-12-31T23:00:00
Data variables:
    u          (time, level, latitude, longitude) float32 dask.array<chunksize=(4, 37, 721, 1440), meta=np.ndarray>
Attributes:
    Conventions:  CF-1.6
    history:      2020-11-20 01:44:50 UTC+1100 by era5_replication_tools-1.7....
    license:      Licence to use Copernicus Products: https://apps.ecmwf.int/...
    summary:      ERA5 is the fifth generation ECMWF atmospheric reanalysis o...
    title:        ERA5 pressure-levels oper u_component_of_wind 20160101-2016...
━━━━━━━━━━━━━━━━━━━━━━━━━━━━━━━━━━━━━━━━━━━━━━━━━━━━━━━━━━━━━━━━━━━━━━━━━━━━━━━━━━━━━━━━━━━━━━━━━━━━━━━━━━━━━━━━━━━━━━━━━━


┌────────────────────────────────────────────────────────────────────────────────────────────────────────────────────────┐
┊                                                Sun Mar 19 21:35:57 2023                                                ┊
┊                rank ▻ 38                                                                                               ┊
┊                node ▻ gadi-cpu-clx-2530.gadi.nci.org.au                                                                ┊
┊                year ▻ 2017                                                                                             ┊
┊              in_dir ▻ /g/data/rt52/era5/pressure-levels/reanalysis/u/2017/*                                            ┊
┊            out_file ▻ /g/data/wb00/admin/testing/nci_5.625/u_component_of_wind/u_component_of_wind_2017_5.625.nc       ┊
└────────────────────────────────────────────────────────────────────────────────────────────────────────────────────────┘
<xarray.Dataset>
Dimensions:    (longitude: 1440, latitude: 721, level: 37, time: 8760)
Coordinates:
  * longitude  (longitude) float32 -180.0 -179.8 -179.5 ... 179.2 179.5 179.8
  * latitude   (latitude) float32 90.0 89.75 89.5 89.25 ... -89.5 -89.75 -90.0
  * level      (level) int32 1 2 3 5 7 10 20 30 ... 850 875 900 925 950 975 1000
  * time       (time) datetime64[ns] 2017-01-01 ... 2017-12-31T23:00:00
Data variables:
    u          (time, level, latitude, longitude) float32 dask.array<chunksize=(4, 37, 721, 1440), meta=np.ndarray>
Attributes:
    Conventions:  CF-1.6
    history:      2020-11-18 22:48:38 UTC+1100 by era5_replication_tools-1.7....
    license:      Licence to use Copernicus Products: https://apps.ecmwf.int/...
    summary:      ERA5 is the fifth generation ECMWF atmospheric reanalysis o...
    title:        ERA5 pressure-levels oper u_component_of_wind 20170101-2017...
━━━━━━━━━━━━━━━━━━━━━━━━━━━━━━━━━━━━━━━━━━━━━━━━━━━━━━━━━━━━━━━━━━━━━━━━━━━━━━━━━━━━━━━━━━━━━━━━━━━━━━━━━━━━━━━━━━━━━━━━━━


┌────────────────────────────────────────────────────────────────────────────────────────────────────────────────────────┐
┊                                                Sun Mar 19 21:35:59 2023                                                ┊
┊                rank ▻ 39                                                                                               ┊
┊                node ▻ gadi-cpu-clx-2530.gadi.nci.org.au                                                                ┊
┊                year ▻ 2018                                                                                             ┊
┊              in_dir ▻ /g/data/rt52/era5/pressure-levels/reanalysis/u/2018/*                                            ┊
┊            out_file ▻ /g/data/wb00/admin/testing/nci_5.625/u_component_of_wind/u_component_of_wind_2018_5.625.nc       ┊
└────────────────────────────────────────────────────────────────────────────────────────────────────────────────────────┘
<xarray.Dataset>
Dimensions:    (longitude: 1440, latitude: 721, level: 37, time: 8760)
Coordinates:
  * longitude  (longitude) float32 -180.0 -179.8 -179.5 ... 179.2 179.5 179.8
  * latitude   (latitude) float32 90.0 89.75 89.5 89.25 ... -89.5 -89.75 -90.0
  * level      (level) int32 1 2 3 5 7 10 20 30 ... 850 875 900 925 950 975 1000
  * time       (time) datetime64[ns] 2018-01-01 ... 2018-12-31T23:00:00
Data variables:
    u          (time, level, latitude, longitude) float32 dask.array<chunksize=(4, 37, 721, 1440), meta=np.ndarray>
Attributes:
    Conventions:  CF-1.6
    history:      2020-11-17 23:39:15 UTC+1100 by era5_replication_tools-1.7....
    license:      Licence to use Copernicus Products: https://apps.ecmwf.int/...
    summary:      ERA5 is the fifth generation ECMWF atmospheric reanalysis o...
    title:        ERA5 pressure-levels oper u_component_of_wind 20180101-2018...
━━━━━━━━━━━━━━━━━━━━━━━━━━━━━━━━━━━━━━━━━━━━━━━━━━━━━━━━━━━━━━━━━━━━━━━━━━━━━━━━━━━━━━━━━━━━━━━━━━━━━━━━━━━━━━━━━━━━━━━━━━


[Sun 19 23:07:37]  End rank: 0,      Out file: /g/data/wb00/admin/testing/nci_5.625/u_component_of_wind/u_component_of_wind_1979_5.625.nc

[Sun 19 23:10:00]  End rank: 37,     Out file: /g/data/wb00/admin/testing/nci_5.625/u_component_of_wind/u_component_of_wind_2016_5.625.nc

[Sun 19 23:13:39]  End rank: 38,     Out file: /g/data/wb00/admin/testing/nci_5.625/u_component_of_wind/u_component_of_wind_2017_5.625.nc

[Sun 19 23:14:05]  End rank: 36,     Out file: /g/data/wb00/admin/testing/nci_5.625/u_component_of_wind/u_component_of_wind_2015_5.625.nc

[Sun 19 23:16:01]  End rank: 28,     Out file: /g/data/wb00/admin/testing/nci_5.625/u_component_of_wind/u_component_of_wind_2007_5.625.nc

[Sun 19 23:17:35]  End rank: 3,      Out file: /g/data/wb00/admin/testing/nci_5.625/u_component_of_wind/u_component_of_wind_1982_5.625.nc

[Sun 19 23:21:20]  End rank: 5,      Out file: /g/data/wb00/admin/testing/nci_5.625/u_component_of_wind/u_component_of_wind_1984_5.625.nc

[Sun 19 23:21:28]  End rank: 29,     Out file: /g/data/wb00/admin/testing/nci_5.625/u_component_of_wind/u_component_of_wind_2008_5.625.nc

[Sun 19 23:21:35]  End rank: 35,     Out file: /g/data/wb00/admin/testing/nci_5.625/u_component_of_wind/u_component_of_wind_2014_5.625.nc

[Sun 19 23:22:44]  End rank: 24,     Out file: /g/data/wb00/admin/testing/nci_5.625/u_component_of_wind/u_component_of_wind_2003_5.625.nc

[Sun 19 23:24:06]  End rank: 39,     Out file: /g/data/wb00/admin/testing/nci_5.625/u_component_of_wind/u_component_of_wind_2018_5.625.nc

[Sun 19 23:26:11]  End rank: 19,     Out file: /g/data/wb00/admin/testing/nci_5.625/u_component_of_wind/u_component_of_wind_1998_5.625.nc

[Sun 19 23:26:14]  End rank: 1,      Out file: /g/data/wb00/admin/testing/nci_5.625/u_component_of_wind/u_component_of_wind_1980_5.625.nc

[Sun 19 23:27:21]  End rank: 10,     Out file: /g/data/wb00/admin/testing/nci_5.625/u_component_of_wind/u_component_of_wind_1989_5.625.nc

[Sun 19 23:29:17]  End rank: 30,     Out file: /g/data/wb00/admin/testing/nci_5.625/u_component_of_wind/u_component_of_wind_2009_5.625.nc

[Sun 19 23:30:06]  End rank: 22,     Out file: /g/data/wb00/admin/testing/nci_5.625/u_component_of_wind/u_component_of_wind_2001_5.625.nc

[Sun 19 23:35:14]  End rank: 31,     Out file: /g/data/wb00/admin/testing/nci_5.625/u_component_of_wind/u_component_of_wind_2010_5.625.nc

[Sun 19 23:35:25]  End rank: 18,     Out file: /g/data/wb00/admin/testing/nci_5.625/u_component_of_wind/u_component_of_wind_1997_5.625.nc

[Sun 19 23:35:53]  End rank: 25,     Out file: /g/data/wb00/admin/testing/nci_5.625/u_component_of_wind/u_component_of_wind_2004_5.625.nc

[Sun 19 23:35:57]  End rank: 2,      Out file: /g/data/wb00/admin/testing/nci_5.625/u_component_of_wind/u_component_of_wind_1981_5.625.nc

[Sun 19 23:36:10]  End rank: 4,      Out file: /g/data/wb00/admin/testing/nci_5.625/u_component_of_wind/u_component_of_wind_1983_5.625.nc

[Sun 19 23:36:55]  End rank: 16,     Out file: /g/data/wb00/admin/testing/nci_5.625/u_component_of_wind/u_component_of_wind_1995_5.625.nc

[Sun 19 23:37:21]  End rank: 20,     Out file: /g/data/wb00/admin/testing/nci_5.625/u_component_of_wind/u_component_of_wind_1999_5.625.nc

[Sun 19 23:38:17]  End rank: 12,     Out file: /g/data/wb00/admin/testing/nci_5.625/u_component_of_wind/u_component_of_wind_1991_5.625.nc

[Sun 19 23:38:38]  End rank: 34,     Out file: /g/data/wb00/admin/testing/nci_5.625/u_component_of_wind/u_component_of_wind_2013_5.625.nc

[Sun 19 23:38:48]  End rank: 13,     Out file: /g/data/wb00/admin/testing/nci_5.625/u_component_of_wind/u_component_of_wind_1992_5.625.nc

[Sun 19 23:39:45]  End rank: 15,     Out file: /g/data/wb00/admin/testing/nci_5.625/u_component_of_wind/u_component_of_wind_1994_5.625.nc

[Sun 19 23:40:17]  End rank: 6,      Out file: /g/data/wb00/admin/testing/nci_5.625/u_component_of_wind/u_component_of_wind_1985_5.625.nc

[Sun 19 23:44:17]  End rank: 33,     Out file: /g/data/wb00/admin/testing/nci_5.625/u_component_of_wind/u_component_of_wind_2012_5.625.nc

[Sun 19 23:44:52]  End rank: 27,     Out file: /g/data/wb00/admin/testing/nci_5.625/u_component_of_wind/u_component_of_wind_2006_5.625.nc

[Sun 19 23:47:23]  End rank: 11,     Out file: /g/data/wb00/admin/testing/nci_5.625/u_component_of_wind/u_component_of_wind_1990_5.625.nc

[Sun 19 23:51:23]  End rank: 14,     Out file: /g/data/wb00/admin/testing/nci_5.625/u_component_of_wind/u_component_of_wind_1993_5.625.nc

[Sun 19 23:51:39]  End rank: 9,      Out file: /g/data/wb00/admin/testing/nci_5.625/u_component_of_wind/u_component_of_wind_1988_5.625.nc

[Sun 19 23:52:00]  End rank: 21,     Out file: /g/data/wb00/admin/testing/nci_5.625/u_component_of_wind/u_component_of_wind_2000_5.625.nc

[Sun 19 23:54:20]  End rank: 8,      Out file: /g/data/wb00/admin/testing/nci_5.625/u_component_of_wind/u_component_of_wind_1987_5.625.nc

[Sun 19 23:56:15]  End rank: 32,     Out file: /g/data/wb00/admin/testing/nci_5.625/u_component_of_wind/u_component_of_wind_2011_5.625.nc

[Mon 20 00:00:24]  End rank: 26,     Out file: /g/data/wb00/admin/testing/nci_5.625/u_component_of_wind/u_component_of_wind_2005_5.625.nc

[Mon 20 00:14:02]  End rank: 17,     Out file: /g/data/wb00/admin/testing/nci_5.625/u_component_of_wind/u_component_of_wind_1996_5.625.nc

[Mon 20 00:29:43]  End rank: 7,      Out file: /g/data/wb00/admin/testing/nci_5.625/u_component_of_wind/u_component_of_wind_1986_5.625.nc

[Mon 20 00:40:05]  End rank: 23,     Out file: /g/data/wb00/admin/testing/nci_5.625/u_component_of_wind/u_component_of_wind_2002_5.625.nc


======================================================================================
                  Resource Usage on 2023-03-20 00:40:32:
   Job Id:             77320111.gadi-pbs
   Project:            fp0
   Exit Status:        0
   Service Units:      2977.07
   NCPUs Requested:    480                    NCPUs Used: 480             
                                           CPU Time Used: 70:39:42        
   Memory Requested:   1.86TB                Memory Used: 1.23TB          
   Walltime requested: 06:00:00            Walltime Used: 03:06:04        
   JobFS requested:    200.0GB                JobFS used: 164.04KB        
======================================================================================
