------------------------------------------------------------
[2024-03-18 01:32:47]

TF Device: [PhysicalDevice(name='/physical_device:GPU:0', device_type='GPU')]
res: 5.625
Data loading...
1999
[1999, 2000, 2001, 2002, 2003, 2004, 2005, 2006, 2007, 2008, 2009, 2010, 2011, 2012, 2013, 2014, 2015, 2016, 2017, 2018, 2019, 2020, 2021, 2022]
Merging ... 
<xarray.DataArray 'time' (time: 10)>
array(['1999-01-01T00:00:00.000000000', '1999-01-01T01:00:00.000000000',
       '1999-01-01T02:00:00.000000000', '1999-01-01T03:00:00.000000000',
       '1999-01-01T04:00:00.000000000', '1999-01-01T05:00:00.000000000',
       '1999-01-01T06:00:00.000000000', '1999-01-01T07:00:00.000000000',
       '1999-01-01T08:00:00.000000000', '1999-01-01T09:00:00.000000000'],
      dtype='datetime64[ns]')
Coordinates:
  * time     (time) datetime64[ns] 1999-01-01 ... 1999-01-01T09:00:00
<xarray.DataArray 'time' (time: 10)>
array(['2022-12-31T14:00:00.000000000', '2022-12-31T15:00:00.000000000',
       '2022-12-31T16:00:00.000000000', '2022-12-31T17:00:00.000000000',
       '2022-12-31T18:00:00.000000000', '2022-12-31T19:00:00.000000000',
       '2022-12-31T20:00:00.000000000', '2022-12-31T21:00:00.000000000',
       '2022-12-31T22:00:00.000000000', '2022-12-31T23:00:00.000000000'],
      dtype='datetime64[ns]')
Coordinates:
  * time     (time) datetime64[ns] 2022-12-31T14:00:00 ... 2022-12-31T23:00:00
test_years: [2021, 2022]
------------------------------------------------------------
72 hours (3 days)
[2024-03-18 01:35:20]
------------------------------------------------------------
input_shape: (32, 64, 2)
lead_time: 72
Model-1

======================================================================================
                  Resource Usage on 2024-03-18 01:35:29:
   Job Id:             111103200.gadi-pbs
   Project:            fp0
   Exit Status:        1
   Service Units:      1.86
   NCPUs Requested:    12                     NCPUs Used: 12              
                                           CPU Time Used: 00:11:25        
   Memory Requested:   100.0GB               Memory Used: 55.42GB         
   NGPUs Requested:    1                 GPU Utilisation: 0%              
                                         GPU Memory Used: 306.0MB         
   Walltime requested: 12:00:00            Walltime Used: 00:02:59        
   JobFS requested:    200.0GB                JobFS used: 2.09KB          
======================================================================================
