2002
2002
/g/data/wb00/admin/testing/cds_era5/single-levels/reanalysis/tp/2002
/g/data/wb00/admin/testing/cds_era5/single-levels/reanalysis/tp/2002/tp_era5_oper_sfc_20020101-20020131.nc
/g/data/wb00/admin/testing/cds_era5/single-levels/reanalysis/tp/2002/tp_era5_oper_sfc_20020201-20020228.nc
/g/data/wb00/admin/testing/cds_era5/single-levels/reanalysis/tp/2002/tp_era5_oper_sfc_20020301-20020331.nc
/g/data/wb00/admin/testing/cds_era5/single-levels/reanalysis/tp/2002/tp_era5_oper_sfc_20020401-20020430.nc
/g/data/wb00/admin/testing/cds_era5/single-levels/reanalysis/tp/2002/tp_era5_oper_sfc_20020501-20020531.nc
/g/data/wb00/admin/testing/cds_era5/single-levels/reanalysis/tp/2002/tp_era5_oper_sfc_20020601-20020630.nc
/g/data/wb00/admin/testing/cds_era5/single-levels/reanalysis/tp/2002/tp_era5_oper_sfc_20020701-20020731.nc
/g/data/wb00/admin/testing/cds_era5/single-levels/reanalysis/tp/2002/tp_era5_oper_sfc_20020801-20020831.nc
/g/data/wb00/admin/testing/cds_era5/single-levels/reanalysis/tp/2002/tp_era5_oper_sfc_20020901-20020930.nc
/g/data/wb00/admin/testing/cds_era5/single-levels/reanalysis/tp/2002/tp_era5_oper_sfc_20021001-20021031.nc
/g/data/wb00/admin/testing/cds_era5/single-levels/reanalysis/tp/2002/tp_era5_oper_sfc_20021101-20021130.nc
/g/data/wb00/admin/testing/cds_era5/single-levels/reanalysis/tp/2002/tp_era5_oper_sfc_20021201-20021231.nc

======================================================================================
                  Resource Usage on 2023-05-20 08:51:41:
   Job Id:             84297958.gadi-pbs
   Project:            fp0
   Exit Status:        0
   Service Units:      30.81
   NCPUs Requested:    1                      NCPUs Used: 1               
                                           CPU Time Used: 00:04:59        
   Memory Requested:   15.0GB                Memory Used: 4.56GB          
   Walltime requested: 10:00:00            Walltime Used: 04:06:31        
   JobFS requested:    10.0GB                 JobFS used: 0B              
======================================================================================
