------------------------------------------------------------
[2024-03-15 22:41:28]

TF Device: [PhysicalDevice(name='/physical_device:GPU:0', device_type='GPU')]
res: 5.625
Data loading...
1959
[1959, 1960, 1961, 1962, 1963, 1964, 1965, 1966, 1967, 1968, 1969, 1970, 1971, 1972, 1973, 1974, 1975, 1976, 1977, 1978, 1979, 1980, 1981, 1982, 1983, 1984, 1985, 1986, 1987, 1988, 1989, 1990, 1991, 1992, 1993, 1994, 1995, 1996, 1997, 1998, 1999, 2000, 2001, 2002, 2003, 2004, 2005, 2006, 2007, 2008, 2009, 2010, 2011, 2012, 2013, 2014, 2015, 2016, 2017, 2018, 2019, 2020, 2021, 2022]
Merging ... 
<xarray.DataArray 'time' (time: 10)>
array(['1959-01-01T00:00:00.000000000', '1959-01-01T01:00:00.000000000',
       '1959-01-01T02:00:00.000000000', '1959-01-01T03:00:00.000000000',
       '1959-01-01T04:00:00.000000000', '1959-01-01T05:00:00.000000000',
       '1959-01-01T06:00:00.000000000', '1959-01-01T07:00:00.000000000',
       '1959-01-01T08:00:00.000000000', '1959-01-01T09:00:00.000000000'],
      dtype='datetime64[ns]')
Coordinates:
  * time     (time) datetime64[ns] 1959-01-01 ... 1959-01-01T09:00:00
<xarray.DataArray 'time' (time: 10)>
array(['2022-12-31T14:00:00.000000000', '2022-12-31T15:00:00.000000000',
       '2022-12-31T16:00:00.000000000', '2022-12-31T17:00:00.000000000',
       '2022-12-31T18:00:00.000000000', '2022-12-31T19:00:00.000000000',
       '2022-12-31T20:00:00.000000000', '2022-12-31T21:00:00.000000000',
       '2022-12-31T22:00:00.000000000', '2022-12-31T23:00:00.000000000'],
      dtype='datetime64[ns]')
Coordinates:
  * time     (time) datetime64[ns] 2022-12-31T14:00:00 ... 2022-12-31T23:00:00
test_years: [2021, 2022]
------------------------------------------------------------
72 hours (3 days)
[2024-03-15 22:46:26]
------------------------------------------------------------
input_shape: (32, 64, 2)
lead_time: 72
save_prefix: 5.625_1959_2022
[2024-03-15 22:46:26]
Data generation ... 
Loading data into RAM
Loading data into RAM
Loading data into RAM
Mean = <xarray.DataArray 'z' (level: 2)>
array([54072.29  ,   274.3925], dtype=float32)
Coordinates:
  * level    (level) int32 500 500; Std = <xarray.DataArray 'z' (level: 2)>
array([1119.3583  ,    5.773593], dtype=float32)
Coordinates:
  * level    (level) int32 500 500
Train model ... 
Model: "model"
_________________________________________________________________
 Layer (type)                Output Shape              Param #   
=================================================================
 input_1 (InputLayer)        [(None, 32, 64, 2)]       0         
                                                                 
 periodic_conv2d (PeriodicC  (None, 31, 63, 64)        12864     
 onv2D)                                                          
                                                                 
 tf.nn.elu (TFOpLambda)      (None, 31, 63, 64)        0         
                                                                 
 periodic_conv2d_1 (Periodi  (None, 30, 62, 128)       819328    
 cConv2D)                                                        
                                                                 
 tf.nn.elu_1 (TFOpLambda)    (None, 30, 62, 128)       0         
                                                                 
 periodic_conv2d_2 (Periodi  (None, 29, 61, 256)       3277056   
 cConv2D)                                                        
                                                                 
 tf.nn.elu_2 (TFOpLambda)    (None, 29, 61, 256)       0         
                                                                 
 periodic_conv2d_3 (Periodi  (None, 28, 60, 512)       13107712  
 cConv2D)                                                        
                                                                 
 tf.nn.elu_3 (TFOpLambda)    (None, 28, 60, 512)       0         
                                                                 
 periodic_conv2d_4 (Periodi  (None, 27, 59, 512)       26214912  
 cConv2D)                                                        
                                                                 
 tf.nn.elu_4 (TFOpLambda)    (None, 27, 59, 512)       0         
                                                                 
 periodic_conv2d_5 (Periodi  (None, 26, 58, 512)       26214912  
 cConv2D)                                                        
                                                                 
 tf.nn.elu_5 (TFOpLambda)    (None, 26, 58, 512)       0         
                                                                 
 periodic_conv2d_6 (Periodi  (None, 25, 57, 512)       26214912  
 cConv2D)                                                        
                                                                 
 tf.nn.elu_6 (TFOpLambda)    (None, 25, 57, 512)       0         
                                                                 
 periodic_conv2d_7 (Periodi  (None, 24, 56, 512)       26214912  
 cConv2D)                                                        
                                                                 
 tf.nn.elu_7 (TFOpLambda)    (None, 24, 56, 512)       0         
                                                                 
 periodic_conv2d_8 (Periodi  (None, 23, 55, 512)       26214912  
 cConv2D)                                                        
                                                                 
 tf.nn.elu_8 (TFOpLambda)    (None, 23, 55, 512)       0         
                                                                 
 periodic_conv2d_9 (Periodi  (None, 22, 54, 512)       26214912  
 cConv2D)                                                        
                                                                 
 tf.nn.elu_9 (TFOpLambda)    (None, 22, 54, 512)       0         
                                                                 
 periodic_conv2d_10 (Period  (None, 21, 53, 512)       26214912  
 icConv2D)                                                       
                                                                 
 tf.nn.elu_10 (TFOpLambda)   (None, 21, 53, 512)       0         
                                                                 
 periodic_conv2d_11 (Period  (None, 20, 52, 512)       26214912  
 icConv2D)                                                       
                                                                 
 tf.nn.elu_11 (TFOpLambda)   (None, 20, 52, 512)       0         
                                                                 
 periodic_conv2d_12 (Period  (None, 19, 51, 512)       26214912  
 icConv2D)                                                       
                                                                 
 tf.nn.elu_12 (TFOpLambda)   (None, 19, 51, 512)       0         
                                                                 
 periodic_conv2d_13 (Period  (None, 18, 50, 256)       13107456  
 icConv2D)                                                       
                                                                 
 tf.nn.elu_13 (TFOpLambda)   (None, 18, 50, 256)       0         
                                                                 
 periodic_conv2d_14 (Period  (None, 17, 49, 128)       3276928   
 icConv2D)                                                       
                                                                 
 tf.nn.elu_14 (TFOpLambda)   (None, 17, 49, 128)       0         
                                                                 
 periodic_conv2d_15 (Period  (None, 16, 48, 64)        819264    
 icConv2D)                                                       
                                                                 
 tf.nn.elu_15 (TFOpLambda)   (None, 16, 48, 64)        0         
                                                                 
 periodic_conv2d_16 (Period  (None, 15, 47, 2)         12802     
 icConv2D)                                                       
                                                                 
=================================================================
Total params: 270367618 (1.01 GB)
Trainable params: 270367618 (1.01 GB)
Non-trainable params: 0 (0.00 Byte)
_________________________________________________________________
None
Epoch 1/100

======================================================================================
                  Resource Usage on 2024-03-15 22:48:02:
   Job Id:             110920928.gadi-pbs
   Project:            fp0
   Exit Status:        1
   Service Units:      8.58
   NCPUs Requested:    12                     NCPUs Used: 12              
                                           CPU Time Used: 00:25:49        
   Memory Requested:   200.0GB               Memory Used: 157.31GB        
   NGPUs Requested:    1                 GPU Utilisation: 33%             
                                         GPU Memory Used: 16.32GB         
   Walltime requested: 12:00:00            Walltime Used: 00:06:52        
   JobFS requested:    200.0GB                JobFS used: 5.55KB          
======================================================================================
