Loading NCI-ai-ml/23.10
  Loading requirement: singularity openmpi/4.1.5
2024-03-15 22:41:16.514026: I tensorflow/core/platform/cpu_feature_guard.cc:182] This TensorFlow binary is optimized to use available CPU instructions in performance-critical operations.
To enable the following instructions: AVX2 AVX512F AVX512_VNNI FMA, in other operations, rebuild TensorFlow with the appropriate compiler flags.
2024-03-15 22:41:24.938380: I tensorflow/core/common_runtime/gpu/gpu_device.cc:1639] Created device /job:localhost/replica:0/task:0/device:GPU:0 with 31141 MB memory:  -> device: 0, name: Tesla V100-SXM2-32GB, pci bus id: 0000:b1:00.0, compute capability: 7.0
2024-03-15 22:47:24.170775: I tensorflow/core/common_runtime/gpu/gpu_device.cc:1639] Created device /job:localhost/replica:0/task:0/device:GPU:0 with 31141 MB memory:  -> device: 0, name: Tesla V100-SXM2-32GB, pci bus id: 0000:b1:00.0, compute capability: 7.0
2024-03-15 22:47:27.837540: I tensorflow/compiler/xla/stream_executor/cuda/cuda_dnn.cc:432] Loaded cuDNN version 8800
2024-03-15 22:47:55.156585: W tensorflow/core/framework/op_kernel.cc:1816] INVALID_ARGUMENT: required broadcastable shapes
Traceback (most recent call last):
  File "/g/data/wb00/admin/testing/NCI_weatherbench/NCI_notebooks_v2/scripts/3b.cnn-example-5.625.py", line 168, in <module>
    model = train(dg_train, dg_valid, dg_test, input_shape, model_save_fn)
  File "/g/data/wb00/admin/testing/NCI_weatherbench/NCI_notebooks_v2/scripts/3b.cnn-example-5.625.py", line 51, in train
    model.fit(dg_train, epochs=100, validation_data=dg_valid,
  File "/opt/conda/envs/mlenv/lib/python3.9/site-packages/keras/src/utils/traceback_utils.py", line 70, in error_handler
    raise e.with_traceback(filtered_tb) from None
  File "/opt/conda/envs/mlenv/lib/python3.9/site-packages/tensorflow/python/eager/execute.py", line 53, in quick_execute
    tensors = pywrap_tfe.TFE_Py_Execute(ctx._handle, device_name, op_name,
tensorflow.python.framework.errors_impl.InvalidArgumentError: Graph execution error:

Detected at node 'mean_squared_error/SquaredDifference' defined at (most recent call last):
    File "/g/data/wb00/admin/testing/NCI_weatherbench/NCI_notebooks_v2/scripts/3b.cnn-example-5.625.py", line 168, in <module>
      model = train(dg_train, dg_valid, dg_test, input_shape, model_save_fn)
    File "/g/data/wb00/admin/testing/NCI_weatherbench/NCI_notebooks_v2/scripts/3b.cnn-example-5.625.py", line 51, in train
      model.fit(dg_train, epochs=100, validation_data=dg_valid,
    File "/opt/conda/envs/mlenv/lib/python3.9/site-packages/keras/src/utils/traceback_utils.py", line 65, in error_handler
      return fn(*args, **kwargs)
    File "/opt/conda/envs/mlenv/lib/python3.9/site-packages/keras/src/engine/training.py", line 1742, in fit
      tmp_logs = self.train_function(iterator)
    File "/opt/conda/envs/mlenv/lib/python3.9/site-packages/keras/src/engine/training.py", line 1338, in train_function
      return step_function(self, iterator)
    File "/opt/conda/envs/mlenv/lib/python3.9/site-packages/keras/src/engine/training.py", line 1322, in step_function
      outputs = model.distribute_strategy.run(run_step, args=(data,))
    File "/opt/conda/envs/mlenv/lib/python3.9/site-packages/keras/src/engine/training.py", line 1303, in run_step
      outputs = model.train_step(data)
    File "/opt/conda/envs/mlenv/lib/python3.9/site-packages/keras/src/engine/training.py", line 1081, in train_step
      loss = self.compute_loss(x, y, y_pred, sample_weight)
    File "/opt/conda/envs/mlenv/lib/python3.9/site-packages/keras/src/engine/training.py", line 1139, in compute_loss
      return self.compiled_loss(
    File "/opt/conda/envs/mlenv/lib/python3.9/site-packages/keras/src/engine/compile_utils.py", line 265, in __call__
      loss_value = loss_obj(y_t, y_p, sample_weight=sw)
    File "/opt/conda/envs/mlenv/lib/python3.9/site-packages/keras/src/losses.py", line 142, in __call__
      losses = call_fn(y_true, y_pred)
    File "/opt/conda/envs/mlenv/lib/python3.9/site-packages/keras/src/losses.py", line 268, in call
      return ag_fn(y_true, y_pred, **self._fn_kwargs)
    File "/opt/conda/envs/mlenv/lib/python3.9/site-packages/keras/src/losses.py", line 1608, in mean_squared_error
      return backend.mean(tf.math.squared_difference(y_pred, y_true), axis=-1)
Node: 'mean_squared_error/SquaredDifference'
required broadcastable shapes
	 [[{{node mean_squared_error/SquaredDifference}}]] [Op:__inference_train_function_5251]
2024-03-15 22:47:57.609899: W tensorflow/core/kernels/data/generator_dataset_op.cc:108] Error occurred when finalizing GeneratorDataset iterator: FAILED_PRECONDITION: Python interpreter state is not initialized. The process may be terminated.
	 [[{{node PyFunc}}]]
