1992
1992
/g/data/wb00/admin/testing/cds_era5/single-levels/reanalysis/tp/1992
/g/data/wb00/admin/testing/cds_era5/single-levels/reanalysis/tp/1992/tp_era5_oper_sfc_19920101-19920131.nc
/g/data/wb00/admin/testing/cds_era5/single-levels/reanalysis/tp/1992/tp_era5_oper_sfc_19920201-19920228.nc
/g/data/wb00/admin/testing/cds_era5/single-levels/reanalysis/tp/1992/tp_era5_oper_sfc_19920301-19920331.nc
/g/data/wb00/admin/testing/cds_era5/single-levels/reanalysis/tp/1992/tp_era5_oper_sfc_19920401-19920430.nc
/g/data/wb00/admin/testing/cds_era5/single-levels/reanalysis/tp/1992/tp_era5_oper_sfc_19920501-19920531.nc
/g/data/wb00/admin/testing/cds_era5/single-levels/reanalysis/tp/1992/tp_era5_oper_sfc_19920601-19920630.nc
/g/data/wb00/admin/testing/cds_era5/single-levels/reanalysis/tp/1992/tp_era5_oper_sfc_19920701-19920731.nc
/g/data/wb00/admin/testing/cds_era5/single-levels/reanalysis/tp/1992/tp_era5_oper_sfc_19920801-19920831.nc
/g/data/wb00/admin/testing/cds_era5/single-levels/reanalysis/tp/1992/tp_era5_oper_sfc_19920901-19920930.nc
/g/data/wb00/admin/testing/cds_era5/single-levels/reanalysis/tp/1992/tp_era5_oper_sfc_19921001-19921031.nc
/g/data/wb00/admin/testing/cds_era5/single-levels/reanalysis/tp/1992/tp_era5_oper_sfc_19921101-19921130.nc
/g/data/wb00/admin/testing/cds_era5/single-levels/reanalysis/tp/1992/tp_era5_oper_sfc_19921201-19921231.nc

======================================================================================
                  Resource Usage on 2023-05-20 04:31:26:
   Job Id:             84297783.gadi-pbs
   Project:            fp0
   Exit Status:        0
   Service Units:      28.80
   NCPUs Requested:    1                      NCPUs Used: 1               
                                           CPU Time Used: 00:05:00        
   Memory Requested:   15.0GB                Memory Used: 3.05GB          
   Walltime requested: 10:00:00            Walltime Used: 03:50:22        
   JobFS requested:    10.0GB                 JobFS used: 0B              
======================================================================================
