2009
2009
/g/data/wb00/admin/testing/cds_era5/single-levels/reanalysis/tp/2009
/g/data/wb00/admin/testing/cds_era5/single-levels/reanalysis/tp/2009/tp_era5_oper_sfc_20090101-20090131.nc
/g/data/wb00/admin/testing/cds_era5/single-levels/reanalysis/tp/2009/tp_era5_oper_sfc_20090201-20090228.nc
/g/data/wb00/admin/testing/cds_era5/single-levels/reanalysis/tp/2009/tp_era5_oper_sfc_20090301-20090331.nc
/g/data/wb00/admin/testing/cds_era5/single-levels/reanalysis/tp/2009/tp_era5_oper_sfc_20090401-20090430.nc
/g/data/wb00/admin/testing/cds_era5/single-levels/reanalysis/tp/2009/tp_era5_oper_sfc_20090501-20090531.nc
/g/data/wb00/admin/testing/cds_era5/single-levels/reanalysis/tp/2009/tp_era5_oper_sfc_20090601-20090630.nc
/g/data/wb00/admin/testing/cds_era5/single-levels/reanalysis/tp/2009/tp_era5_oper_sfc_20090701-20090731.nc
/g/data/wb00/admin/testing/cds_era5/single-levels/reanalysis/tp/2009/tp_era5_oper_sfc_20090801-20090831.nc
/g/data/wb00/admin/testing/cds_era5/single-levels/reanalysis/tp/2009/tp_era5_oper_sfc_20090901-20090930.nc
/g/data/wb00/admin/testing/cds_era5/single-levels/reanalysis/tp/2009/tp_era5_oper_sfc_20091001-20091031.nc
/g/data/wb00/admin/testing/cds_era5/single-levels/reanalysis/tp/2009/tp_era5_oper_sfc_20091101-20091130.nc
/g/data/wb00/admin/testing/cds_era5/single-levels/reanalysis/tp/2009/tp_era5_oper_sfc_20091201-20091231.nc

======================================================================================
                  Resource Usage on 2023-05-20 09:26:52:
   Job Id:             84298056.gadi-pbs
   Project:            fp0
   Exit Status:        0
   Service Units:      33.76
   NCPUs Requested:    1                      NCPUs Used: 1               
                                           CPU Time Used: 00:04:41        
   Memory Requested:   15.0GB                Memory Used: 5.42GB          
   Walltime requested: 10:00:00            Walltime Used: 04:30:07        
   JobFS requested:    10.0GB                 JobFS used: 0B              
======================================================================================
