
======================   ALLOCATED NODES   ======================
	gadi-cpu-clx-1627: flags=0x11 slots=48 max_slots=0 slots_inuse=0 state=UP
	gadi-cpu-clx-1629: flags=0x13 slots=48 max_slots=0 slots_inuse=0 state=UP
	gadi-cpu-clx-1630: flags=0x13 slots=48 max_slots=0 slots_inuse=0 state=UP
	gadi-cpu-clx-1632: flags=0x13 slots=48 max_slots=0 slots_inuse=0 state=UP
	gadi-cpu-clx-1633: flags=0x13 slots=48 max_slots=0 slots_inuse=0 state=UP
	gadi-cpu-clx-1635: flags=0x13 slots=48 max_slots=0 slots_inuse=0 state=UP
	gadi-cpu-clx-1637: flags=0x13 slots=48 max_slots=0 slots_inuse=0 state=UP
	gadi-cpu-clx-1638: flags=0x13 slots=48 max_slots=0 slots_inuse=0 state=UP
	gadi-cpu-clx-1639: flags=0x13 slots=48 max_slots=0 slots_inuse=0 state=UP
	gadi-cpu-clx-1640: flags=0x13 slots=48 max_slots=0 slots_inuse=0 state=UP
=================================================================
App launch reported: 10 (out of 10) daemons - 9 (out of 10) procs
rank: 28    host: gadi-cpu-clx-1638.gadi.nci.org.au
rank: 16    host: gadi-cpu-clx-1633.gadi.nci.org.au
rank: 20    host: gadi-cpu-clx-1635.gadi.nci.org.au
rank: 4     host: gadi-cpu-clx-1629.gadi.nci.org.au
rank: 0     host: gadi-cpu-clx-1627.gadi.nci.org.au
rank: 32    host: gadi-cpu-clx-1639.gadi.nci.org.au
rank: 24    host: gadi-cpu-clx-1637.gadi.nci.org.au
rank: 8     host: gadi-cpu-clx-1630.gadi.nci.org.au
rank: 12    host: gadi-cpu-clx-1632.gadi.nci.org.au
rank: 36    host: gadi-cpu-clx-1640.gadi.nci.org.au
rank: 29    host: gadi-cpu-clx-1638.gadi.nci.org.au
rank: 17    host: gadi-cpu-clx-1633.gadi.nci.org.au
rank: 21    host: gadi-cpu-clx-1635.gadi.nci.org.au
rank: 5     host: gadi-cpu-clx-1629.gadi.nci.org.au
rank: 33    host: gadi-cpu-clx-1639.gadi.nci.org.au
rank: 25    host: gadi-cpu-clx-1637.gadi.nci.org.au
rank: 9     host: gadi-cpu-clx-1630.gadi.nci.org.au
rank: 1     host: gadi-cpu-clx-1627.gadi.nci.org.au
rank: 13    host: gadi-cpu-clx-1632.gadi.nci.org.au
rank: 37    host: gadi-cpu-clx-1640.gadi.nci.org.au
rank: 30    host: gadi-cpu-clx-1638.gadi.nci.org.au
rank: 18    host: gadi-cpu-clx-1633.gadi.nci.org.au
rank: 6     host: gadi-cpu-clx-1629.gadi.nci.org.au
rank: 22    host: gadi-cpu-clx-1635.gadi.nci.org.au
rank: 26    host: gadi-cpu-clx-1637.gadi.nci.org.au
rank: 10    host: gadi-cpu-clx-1630.gadi.nci.org.au
rank: 34    host: gadi-cpu-clx-1639.gadi.nci.org.au
rank: 2     host: gadi-cpu-clx-1627.gadi.nci.org.au
rank: 38    host: gadi-cpu-clx-1640.gadi.nci.org.au
rank: 14    host: gadi-cpu-clx-1632.gadi.nci.org.au
rank: 31    host: gadi-cpu-clx-1638.gadi.nci.org.au
rank: 3     host: gadi-cpu-clx-1627.gadi.nci.org.au
rank: 19    host: gadi-cpu-clx-1633.gadi.nci.org.au
rank: 7     host: gadi-cpu-clx-1629.gadi.nci.org.au
rank: 27    host: gadi-cpu-clx-1637.gadi.nci.org.au
rank: 11    host: gadi-cpu-clx-1630.gadi.nci.org.au
rank: 23    host: gadi-cpu-clx-1635.gadi.nci.org.au
rank: 39    host: gadi-cpu-clx-1640.gadi.nci.org.au
rank: 35    host: gadi-cpu-clx-1639.gadi.nci.org.au
rank: 15    host: gadi-cpu-clx-1632.gadi.nci.org.au
╔════════════════════════════════════════════════════════════════════════════════════════════════════════════════════════╗
║ ╔════════════════════════════════════════════════════════════════════════════════════════════════════════════════════╗ ║
║ ║                                                    Common Param                                                    ║ ║
║ ║           ERA_param ▶ 10v                                                                                          ║ ║
║ ║    config_file_path ▶ /scratch/fp0/mah900/WeatherBench/pbs_scripts/config_10m_v_component_of_wind.yml              ║ ║
║ ║             out_deg ▶ 5.625000                                                                                     ║ ║
║ ║           algorithm ▶ bilinear                                                                                     ║ ║
║ ║      pressure_level ▶ None                                                                                         ║ ║
║ ║       in_dir_prefix ▶ /g/data/rt52/era5/single-levels/reanalysis/10v                                               ║ ║
║ ║     out_file_prefix ▶ /g/data/wb00/admin/testing/nci_5.625/10m_v_component_of_wind/10m_v_component_of_wind         ║ ║
║ ╚════════════════════════════════════════════════════════════════════════════════════════════════════════════════════╝ ║
╚════════════════════════════════════════════════════════════════════════════════════════════════════════════════════════╝


┌────────────────────────────────────────────────────────────────────────────────────────────────────────────────────────┐
┊                                                Mon Mar 20 01:04:58 2023                                                ┊
┊                rank ▻ 0                                                                                                ┊
┊                node ▻ gadi-cpu-clx-1627.gadi.nci.org.au                                                                ┊
┊                year ▻ 1979                                                                                             ┊
┊              in_dir ▻ /g/data/rt52/era5/single-levels/reanalysis/10v/1979/*                                            ┊
┊            out_file ▻ /g/data/wb00/admin/testing/nci_5.625/10m_v_component_of_wind/10m_v_component_of_wind_1979_5.625.nc┊
└────────────────────────────────────────────────────────────────────────────────────────────────────────────────────────┘
<xarray.Dataset>
Dimensions:    (longitude: 1440, latitude: 721, time: 8760)
Coordinates:
  * longitude  (longitude) float32 -180.0 -179.8 -179.5 ... 179.2 179.5 179.8
  * latitude   (latitude) float32 90.0 89.75 89.5 89.25 ... -89.5 -89.75 -90.0
  * time       (time) datetime64[ns] 1979-01-01 ... 1979-12-31T23:00:00
Data variables:
    v10        (time, latitude, longitude) float32 dask.array<chunksize=(4, 721, 1440), meta=np.ndarray>
Attributes:
    Conventions:  CF-1.6
    history:      2020-10-04 20:18:05 UTC+1100 by era5_replication_tools-1.2....
    license:      Licence to use Copernicus Products: https://apps.ecmwf.int/...
    summary:      ERA5 is the fifth generation ECMWF atmospheric reanalysis o...
    title:        ERA5 single-levels reanalysis 10m_v_component_of_wind 19790...
━━━━━━━━━━━━━━━━━━━━━━━━━━━━━━━━━━━━━━━━━━━━━━━━━━━━━━━━━━━━━━━━━━━━━━━━━━━━━━━━━━━━━━━━━━━━━━━━━━━━━━━━━━━━━━━━━━━━━━━━━━


┌────────────────────────────────────────────────────────────────────────────────────────────────────────────────────────┐
┊                                                Mon Mar 20 01:05:03 2023                                                ┊
┊                rank ▻ 1                                                                                                ┊
┊                node ▻ gadi-cpu-clx-1627.gadi.nci.org.au                                                                ┊
┊                year ▻ 1980                                                                                             ┊
┊              in_dir ▻ /g/data/rt52/era5/single-levels/reanalysis/10v/1980/*                                            ┊
┊            out_file ▻ /g/data/wb00/admin/testing/nci_5.625/10m_v_component_of_wind/10m_v_component_of_wind_1980_5.625.nc┊
└────────────────────────────────────────────────────────────────────────────────────────────────────────────────────────┘
<xarray.Dataset>
Dimensions:    (longitude: 1440, latitude: 721, time: 8784)
Coordinates:
  * longitude  (longitude) float32 -180.0 -179.8 -179.5 ... 179.2 179.5 179.8
  * latitude   (latitude) float32 90.0 89.75 89.5 89.25 ... -89.5 -89.75 -90.0
  * time       (time) datetime64[ns] 1980-01-01 ... 1980-12-31T23:00:00
Data variables:
    v10        (time, latitude, longitude) float32 dask.array<chunksize=(4, 721, 1440), meta=np.ndarray>
Attributes:
    Conventions:  CF-1.6
    history:      2020-10-04 15:35:12 UTC+1100 by era5_replication_tools-1.2....
    license:      Licence to use Copernicus Products: https://apps.ecmwf.int/...
    summary:      ERA5 is the fifth generation ECMWF atmospheric reanalysis o...
    title:        ERA5 single-levels reanalysis 10m_v_component_of_wind 19800...
━━━━━━━━━━━━━━━━━━━━━━━━━━━━━━━━━━━━━━━━━━━━━━━━━━━━━━━━━━━━━━━━━━━━━━━━━━━━━━━━━━━━━━━━━━━━━━━━━━━━━━━━━━━━━━━━━━━━━━━━━━


┌────────────────────────────────────────────────────────────────────────────────────────────────────────────────────────┐
┊                                                Mon Mar 20 01:05:05 2023                                                ┊
┊                rank ▻ 2                                                                                                ┊
┊                node ▻ gadi-cpu-clx-1627.gadi.nci.org.au                                                                ┊
┊                year ▻ 1981                                                                                             ┊
┊              in_dir ▻ /g/data/rt52/era5/single-levels/reanalysis/10v/1981/*                                            ┊
┊            out_file ▻ /g/data/wb00/admin/testing/nci_5.625/10m_v_component_of_wind/10m_v_component_of_wind_1981_5.625.nc┊
└────────────────────────────────────────────────────────────────────────────────────────────────────────────────────────┘
<xarray.Dataset>
Dimensions:    (longitude: 1440, latitude: 721, time: 8760)
Coordinates:
  * longitude  (longitude) float32 -180.0 -179.8 -179.5 ... 179.2 179.5 179.8
  * latitude   (latitude) float32 90.0 89.75 89.5 89.25 ... -89.5 -89.75 -90.0
  * time       (time) datetime64[ns] 1981-01-01 ... 1981-12-31T23:00:00
Data variables:
    v10        (time, latitude, longitude) float32 dask.array<chunksize=(4, 721, 1440), meta=np.ndarray>
Attributes:
    Conventions:  CF-1.6
    history:      2020-10-04 12:05:36 UTC+1100 by era5_replication_tools-1.2....
    license:      Licence to use Copernicus Products: https://apps.ecmwf.int/...
    summary:      ERA5 is the fifth generation ECMWF atmospheric reanalysis o...
    title:        ERA5 single-levels reanalysis 10m_v_component_of_wind 19810...
━━━━━━━━━━━━━━━━━━━━━━━━━━━━━━━━━━━━━━━━━━━━━━━━━━━━━━━━━━━━━━━━━━━━━━━━━━━━━━━━━━━━━━━━━━━━━━━━━━━━━━━━━━━━━━━━━━━━━━━━━━


┌────────────────────────────────────────────────────────────────────────────────────────────────────────────────────────┐
┊                                                Mon Mar 20 01:05:07 2023                                                ┊
┊                rank ▻ 3                                                                                                ┊
┊                node ▻ gadi-cpu-clx-1627.gadi.nci.org.au                                                                ┊
┊                year ▻ 1982                                                                                             ┊
┊              in_dir ▻ /g/data/rt52/era5/single-levels/reanalysis/10v/1982/*                                            ┊
┊            out_file ▻ /g/data/wb00/admin/testing/nci_5.625/10m_v_component_of_wind/10m_v_component_of_wind_1982_5.625.nc┊
└────────────────────────────────────────────────────────────────────────────────────────────────────────────────────────┘
<xarray.Dataset>
Dimensions:    (longitude: 1440, latitude: 721, time: 8760)
Coordinates:
  * longitude  (longitude) float32 -180.0 -179.8 -179.5 ... 179.2 179.5 179.8
  * latitude   (latitude) float32 90.0 89.75 89.5 89.25 ... -89.5 -89.75 -90.0
  * time       (time) datetime64[ns] 1982-01-01 ... 1982-12-31T23:00:00
Data variables:
    v10        (time, latitude, longitude) float32 dask.array<chunksize=(4, 721, 1440), meta=np.ndarray>
Attributes:
    Conventions:  CF-1.6
    history:      2020-10-04 08:08:38 UTC+1100 by era5_replication_tools-1.2....
    license:      Licence to use Copernicus Products: https://apps.ecmwf.int/...
    summary:      ERA5 is the fifth generation ECMWF atmospheric reanalysis o...
    title:        ERA5 single-levels reanalysis 10m_v_component_of_wind 19820...
━━━━━━━━━━━━━━━━━━━━━━━━━━━━━━━━━━━━━━━━━━━━━━━━━━━━━━━━━━━━━━━━━━━━━━━━━━━━━━━━━━━━━━━━━━━━━━━━━━━━━━━━━━━━━━━━━━━━━━━━━━


┌────────────────────────────────────────────────────────────────────────────────────────────────────────────────────────┐
┊                                                Mon Mar 20 01:05:09 2023                                                ┊
┊                rank ▻ 4                                                                                                ┊
┊                node ▻ gadi-cpu-clx-1629.gadi.nci.org.au                                                                ┊
┊                year ▻ 1983                                                                                             ┊
┊              in_dir ▻ /g/data/rt52/era5/single-levels/reanalysis/10v/1983/*                                            ┊
┊            out_file ▻ /g/data/wb00/admin/testing/nci_5.625/10m_v_component_of_wind/10m_v_component_of_wind_1983_5.625.nc┊
└────────────────────────────────────────────────────────────────────────────────────────────────────────────────────────┘
<xarray.Dataset>
Dimensions:    (longitude: 1440, latitude: 721, time: 8760)
Coordinates:
  * longitude  (longitude) float32 -180.0 -179.8 -179.5 ... 179.2 179.5 179.8
  * latitude   (latitude) float32 90.0 89.75 89.5 89.25 ... -89.5 -89.75 -90.0
  * time       (time) datetime64[ns] 1983-01-01 ... 1983-12-31T23:00:00
Data variables:
    v10        (time, latitude, longitude) float32 dask.array<chunksize=(4, 721, 1440), meta=np.ndarray>
Attributes:
    Conventions:  CF-1.6
    history:      2020-10-04 03:15:36 UTC+1100 by era5_replication_tools-1.2....
    license:      Licence to use Copernicus Products: https://apps.ecmwf.int/...
    summary:      ERA5 is the fifth generation ECMWF atmospheric reanalysis o...
    title:        ERA5 single-levels reanalysis 10m_v_component_of_wind 19830...
━━━━━━━━━━━━━━━━━━━━━━━━━━━━━━━━━━━━━━━━━━━━━━━━━━━━━━━━━━━━━━━━━━━━━━━━━━━━━━━━━━━━━━━━━━━━━━━━━━━━━━━━━━━━━━━━━━━━━━━━━━


┌────────────────────────────────────────────────────────────────────────────────────────────────────────────────────────┐
┊                                                Mon Mar 20 01:05:11 2023                                                ┊
┊                rank ▻ 5                                                                                                ┊
┊                node ▻ gadi-cpu-clx-1629.gadi.nci.org.au                                                                ┊
┊                year ▻ 1984                                                                                             ┊
┊              in_dir ▻ /g/data/rt52/era5/single-levels/reanalysis/10v/1984/*                                            ┊
┊            out_file ▻ /g/data/wb00/admin/testing/nci_5.625/10m_v_component_of_wind/10m_v_component_of_wind_1984_5.625.nc┊
└────────────────────────────────────────────────────────────────────────────────────────────────────────────────────────┘
<xarray.Dataset>
Dimensions:    (longitude: 1440, latitude: 721, time: 8784)
Coordinates:
  * longitude  (longitude) float32 -180.0 -179.8 -179.5 ... 179.2 179.5 179.8
  * latitude   (latitude) float32 90.0 89.75 89.5 89.25 ... -89.5 -89.75 -90.0
  * time       (time) datetime64[ns] 1984-01-01 ... 1984-12-31T23:00:00
Data variables:
    v10        (time, latitude, longitude) float32 dask.array<chunksize=(4, 721, 1440), meta=np.ndarray>
Attributes:
    Conventions:  CF-1.6
    history:      2020-10-03 22:35:18 UTC+1000 by era5_replication_tools-1.2....
    license:      Licence to use Copernicus Products: https://apps.ecmwf.int/...
    summary:      ERA5 is the fifth generation ECMWF atmospheric reanalysis o...
    title:        ERA5 single-levels reanalysis 10m_v_component_of_wind 19840...
━━━━━━━━━━━━━━━━━━━━━━━━━━━━━━━━━━━━━━━━━━━━━━━━━━━━━━━━━━━━━━━━━━━━━━━━━━━━━━━━━━━━━━━━━━━━━━━━━━━━━━━━━━━━━━━━━━━━━━━━━━


┌────────────────────────────────────────────────────────────────────────────────────────────────────────────────────────┐
┊                                                Mon Mar 20 01:05:13 2023                                                ┊
┊                rank ▻ 6                                                                                                ┊
┊                node ▻ gadi-cpu-clx-1629.gadi.nci.org.au                                                                ┊
┊                year ▻ 1985                                                                                             ┊
┊              in_dir ▻ /g/data/rt52/era5/single-levels/reanalysis/10v/1985/*                                            ┊
┊            out_file ▻ /g/data/wb00/admin/testing/nci_5.625/10m_v_component_of_wind/10m_v_component_of_wind_1985_5.625.nc┊
└────────────────────────────────────────────────────────────────────────────────────────────────────────────────────────┘
<xarray.Dataset>
Dimensions:    (longitude: 1440, latitude: 721, time: 8760)
Coordinates:
  * longitude  (longitude) float32 -180.0 -179.8 -179.5 ... 179.2 179.5 179.8
  * latitude   (latitude) float32 90.0 89.75 89.5 89.25 ... -89.5 -89.75 -90.0
  * time       (time) datetime64[ns] 1985-01-01 ... 1985-12-31T23:00:00
Data variables:
    v10        (time, latitude, longitude) float32 dask.array<chunksize=(4, 721, 1440), meta=np.ndarray>
Attributes:
    Conventions:  CF-1.6
    history:      2020-10-03 18:19:32 UTC+1000 by era5_replication_tools-1.2....
    license:      Licence to use Copernicus Products: https://apps.ecmwf.int/...
    summary:      ERA5 is the fifth generation ECMWF atmospheric reanalysis o...
    title:        ERA5 single-levels reanalysis 10m_v_component_of_wind 19850...
━━━━━━━━━━━━━━━━━━━━━━━━━━━━━━━━━━━━━━━━━━━━━━━━━━━━━━━━━━━━━━━━━━━━━━━━━━━━━━━━━━━━━━━━━━━━━━━━━━━━━━━━━━━━━━━━━━━━━━━━━━


┌────────────────────────────────────────────────────────────────────────────────────────────────────────────────────────┐
┊                                                Mon Mar 20 01:05:15 2023                                                ┊
┊                rank ▻ 7                                                                                                ┊
┊                node ▻ gadi-cpu-clx-1629.gadi.nci.org.au                                                                ┊
┊                year ▻ 1986                                                                                             ┊
┊              in_dir ▻ /g/data/rt52/era5/single-levels/reanalysis/10v/1986/*                                            ┊
┊            out_file ▻ /g/data/wb00/admin/testing/nci_5.625/10m_v_component_of_wind/10m_v_component_of_wind_1986_5.625.nc┊
└────────────────────────────────────────────────────────────────────────────────────────────────────────────────────────┘
<xarray.Dataset>
Dimensions:    (longitude: 1440, latitude: 721, time: 8760)
Coordinates:
  * longitude  (longitude) float32 -180.0 -179.8 -179.5 ... 179.2 179.5 179.8
  * latitude   (latitude) float32 90.0 89.75 89.5 89.25 ... -89.5 -89.75 -90.0
  * time       (time) datetime64[ns] 1986-01-01 ... 1986-12-31T23:00:00
Data variables:
    v10        (time, latitude, longitude) float32 dask.array<chunksize=(4, 721, 1440), meta=np.ndarray>
Attributes:
    Conventions:  CF-1.6
    history:      2020-10-03 13:19:02 UTC+1000 by era5_replication_tools-1.2....
    license:      Licence to use Copernicus Products: https://apps.ecmwf.int/...
    summary:      ERA5 is the fifth generation ECMWF atmospheric reanalysis o...
    title:        ERA5 single-levels reanalysis 10m_v_component_of_wind 19860...
━━━━━━━━━━━━━━━━━━━━━━━━━━━━━━━━━━━━━━━━━━━━━━━━━━━━━━━━━━━━━━━━━━━━━━━━━━━━━━━━━━━━━━━━━━━━━━━━━━━━━━━━━━━━━━━━━━━━━━━━━━


┌────────────────────────────────────────────────────────────────────────────────────────────────────────────────────────┐
┊                                                Mon Mar 20 01:05:17 2023                                                ┊
┊                rank ▻ 8                                                                                                ┊
┊                node ▻ gadi-cpu-clx-1630.gadi.nci.org.au                                                                ┊
┊                year ▻ 1987                                                                                             ┊
┊              in_dir ▻ /g/data/rt52/era5/single-levels/reanalysis/10v/1987/*                                            ┊
┊            out_file ▻ /g/data/wb00/admin/testing/nci_5.625/10m_v_component_of_wind/10m_v_component_of_wind_1987_5.625.nc┊
└────────────────────────────────────────────────────────────────────────────────────────────────────────────────────────┘
<xarray.Dataset>
Dimensions:    (longitude: 1440, latitude: 721, time: 8760)
Coordinates:
  * longitude  (longitude) float32 -180.0 -179.8 -179.5 ... 179.2 179.5 179.8
  * latitude   (latitude) float32 90.0 89.75 89.5 89.25 ... -89.5 -89.75 -90.0
  * time       (time) datetime64[ns] 1987-01-01 ... 1987-12-31T23:00:00
Data variables:
    v10        (time, latitude, longitude) float32 dask.array<chunksize=(4, 721, 1440), meta=np.ndarray>
Attributes:
    Conventions:  CF-1.6
    history:      2020-10-03 08:43:48 UTC+1000 by era5_replication_tools-1.2....
    license:      Licence to use Copernicus Products: https://apps.ecmwf.int/...
    summary:      ERA5 is the fifth generation ECMWF atmospheric reanalysis o...
    title:        ERA5 single-levels reanalysis 10m_v_component_of_wind 19870...
━━━━━━━━━━━━━━━━━━━━━━━━━━━━━━━━━━━━━━━━━━━━━━━━━━━━━━━━━━━━━━━━━━━━━━━━━━━━━━━━━━━━━━━━━━━━━━━━━━━━━━━━━━━━━━━━━━━━━━━━━━


┌────────────────────────────────────────────────────────────────────────────────────────────────────────────────────────┐
┊                                                Mon Mar 20 01:05:19 2023                                                ┊
┊                rank ▻ 9                                                                                                ┊
┊                node ▻ gadi-cpu-clx-1630.gadi.nci.org.au                                                                ┊
┊                year ▻ 1988                                                                                             ┊
┊              in_dir ▻ /g/data/rt52/era5/single-levels/reanalysis/10v/1988/*                                            ┊
┊            out_file ▻ /g/data/wb00/admin/testing/nci_5.625/10m_v_component_of_wind/10m_v_component_of_wind_1988_5.625.nc┊
└────────────────────────────────────────────────────────────────────────────────────────────────────────────────────────┘
<xarray.Dataset>
Dimensions:    (longitude: 1440, latitude: 721, time: 8784)
Coordinates:
  * longitude  (longitude) float32 -180.0 -179.8 -179.5 ... 179.2 179.5 179.8
  * latitude   (latitude) float32 90.0 89.75 89.5 89.25 ... -89.5 -89.75 -90.0
  * time       (time) datetime64[ns] 1988-01-01 ... 1988-12-31T23:00:00
Data variables:
    v10        (time, latitude, longitude) float32 dask.array<chunksize=(4, 721, 1440), meta=np.ndarray>
Attributes:
    Conventions:  CF-1.6
    history:      2020-10-03 03:35:19 UTC+1000 by era5_replication_tools-1.2....
    license:      Licence to use Copernicus Products: https://apps.ecmwf.int/...
    summary:      ERA5 is the fifth generation ECMWF atmospheric reanalysis o...
    title:        ERA5 single-levels reanalysis 10m_v_component_of_wind 19880...
━━━━━━━━━━━━━━━━━━━━━━━━━━━━━━━━━━━━━━━━━━━━━━━━━━━━━━━━━━━━━━━━━━━━━━━━━━━━━━━━━━━━━━━━━━━━━━━━━━━━━━━━━━━━━━━━━━━━━━━━━━


┌────────────────────────────────────────────────────────────────────────────────────────────────────────────────────────┐
┊                                                Mon Mar 20 01:05:21 2023                                                ┊
┊                rank ▻ 10                                                                                               ┊
┊                node ▻ gadi-cpu-clx-1630.gadi.nci.org.au                                                                ┊
┊                year ▻ 1989                                                                                             ┊
┊              in_dir ▻ /g/data/rt52/era5/single-levels/reanalysis/10v/1989/*                                            ┊
┊            out_file ▻ /g/data/wb00/admin/testing/nci_5.625/10m_v_component_of_wind/10m_v_component_of_wind_1989_5.625.nc┊
└────────────────────────────────────────────────────────────────────────────────────────────────────────────────────────┘
<xarray.Dataset>
Dimensions:    (longitude: 1440, latitude: 721, time: 8760)
Coordinates:
  * longitude  (longitude) float32 -180.0 -179.8 -179.5 ... 179.2 179.5 179.8
  * latitude   (latitude) float32 90.0 89.75 89.5 89.25 ... -89.5 -89.75 -90.0
  * time       (time) datetime64[ns] 1989-01-01 ... 1989-12-31T23:00:00
Data variables:
    v10        (time, latitude, longitude) float32 dask.array<chunksize=(4, 721, 1440), meta=np.ndarray>
Attributes:
    Conventions:  CF-1.6
    history:      2020-10-02 23:37:36 UTC+1000 by era5_replication_tools-1.2....
    license:      Licence to use Copernicus Products: https://apps.ecmwf.int/...
    summary:      ERA5 is the fifth generation ECMWF atmospheric reanalysis o...
    title:        ERA5 single-levels reanalysis 10m_v_component_of_wind 19890...
━━━━━━━━━━━━━━━━━━━━━━━━━━━━━━━━━━━━━━━━━━━━━━━━━━━━━━━━━━━━━━━━━━━━━━━━━━━━━━━━━━━━━━━━━━━━━━━━━━━━━━━━━━━━━━━━━━━━━━━━━━


┌────────────────────────────────────────────────────────────────────────────────────────────────────────────────────────┐
┊                                                Mon Mar 20 01:05:23 2023                                                ┊
┊                rank ▻ 11                                                                                               ┊
┊                node ▻ gadi-cpu-clx-1630.gadi.nci.org.au                                                                ┊
┊                year ▻ 1990                                                                                             ┊
┊              in_dir ▻ /g/data/rt52/era5/single-levels/reanalysis/10v/1990/*                                            ┊
┊            out_file ▻ /g/data/wb00/admin/testing/nci_5.625/10m_v_component_of_wind/10m_v_component_of_wind_1990_5.625.nc┊
└────────────────────────────────────────────────────────────────────────────────────────────────────────────────────────┘
<xarray.Dataset>
Dimensions:    (longitude: 1440, latitude: 721, time: 8760)
Coordinates:
  * longitude  (longitude) float32 -180.0 -179.8 -179.5 ... 179.2 179.5 179.8
  * latitude   (latitude) float32 90.0 89.75 89.5 89.25 ... -89.5 -89.75 -90.0
  * time       (time) datetime64[ns] 1990-01-01 ... 1990-12-31T23:00:00
Data variables:
    v10        (time, latitude, longitude) float32 dask.array<chunksize=(4, 721, 1440), meta=np.ndarray>
Attributes:
    Conventions:  CF-1.6
    history:      2020-10-02 19:01:45 UTC+1000 by era5_replication_tools-1.2....
    license:      Licence to use Copernicus Products: https://apps.ecmwf.int/...
    summary:      ERA5 is the fifth generation ECMWF atmospheric reanalysis o...
    title:        ERA5 single-levels reanalysis 10m_v_component_of_wind 19900...
━━━━━━━━━━━━━━━━━━━━━━━━━━━━━━━━━━━━━━━━━━━━━━━━━━━━━━━━━━━━━━━━━━━━━━━━━━━━━━━━━━━━━━━━━━━━━━━━━━━━━━━━━━━━━━━━━━━━━━━━━━


┌────────────────────────────────────────────────────────────────────────────────────────────────────────────────────────┐
┊                                                Mon Mar 20 01:05:25 2023                                                ┊
┊                rank ▻ 12                                                                                               ┊
┊                node ▻ gadi-cpu-clx-1632.gadi.nci.org.au                                                                ┊
┊                year ▻ 1991                                                                                             ┊
┊              in_dir ▻ /g/data/rt52/era5/single-levels/reanalysis/10v/1991/*                                            ┊
┊            out_file ▻ /g/data/wb00/admin/testing/nci_5.625/10m_v_component_of_wind/10m_v_component_of_wind_1991_5.625.nc┊
└────────────────────────────────────────────────────────────────────────────────────────────────────────────────────────┘
<xarray.Dataset>
Dimensions:    (longitude: 1440, latitude: 721, time: 8760)
Coordinates:
  * longitude  (longitude) float32 -180.0 -179.8 -179.5 ... 179.2 179.5 179.8
  * latitude   (latitude) float32 90.0 89.75 89.5 89.25 ... -89.5 -89.75 -90.0
  * time       (time) datetime64[ns] 1991-01-01 ... 1991-12-31T23:00:00
Data variables:
    v10        (time, latitude, longitude) float32 dask.array<chunksize=(4, 721, 1440), meta=np.ndarray>
Attributes:
    Conventions:  CF-1.6
    history:      2020-10-02 13:50:44 UTC+1000 by era5_replication_tools-1.2....
    license:      Licence to use Copernicus Products: https://apps.ecmwf.int/...
    summary:      ERA5 is the fifth generation ECMWF atmospheric reanalysis o...
    title:        ERA5 single-levels reanalysis 10m_v_component_of_wind 19910...
━━━━━━━━━━━━━━━━━━━━━━━━━━━━━━━━━━━━━━━━━━━━━━━━━━━━━━━━━━━━━━━━━━━━━━━━━━━━━━━━━━━━━━━━━━━━━━━━━━━━━━━━━━━━━━━━━━━━━━━━━━


┌────────────────────────────────────────────────────────────────────────────────────────────────────────────────────────┐
┊                                                Mon Mar 20 01:05:27 2023                                                ┊
┊                rank ▻ 13                                                                                               ┊
┊                node ▻ gadi-cpu-clx-1632.gadi.nci.org.au                                                                ┊
┊                year ▻ 1992                                                                                             ┊
┊              in_dir ▻ /g/data/rt52/era5/single-levels/reanalysis/10v/1992/*                                            ┊
┊            out_file ▻ /g/data/wb00/admin/testing/nci_5.625/10m_v_component_of_wind/10m_v_component_of_wind_1992_5.625.nc┊
└────────────────────────────────────────────────────────────────────────────────────────────────────────────────────────┘
<xarray.Dataset>
Dimensions:    (longitude: 1440, latitude: 721, time: 8784)
Coordinates:
  * longitude  (longitude) float32 -180.0 -179.8 -179.5 ... 179.2 179.5 179.8
  * latitude   (latitude) float32 90.0 89.75 89.5 89.25 ... -89.5 -89.75 -90.0
  * time       (time) datetime64[ns] 1992-01-01 ... 1992-12-31T23:00:00
Data variables:
    v10        (time, latitude, longitude) float32 dask.array<chunksize=(4, 721, 1440), meta=np.ndarray>
Attributes:
    Conventions:  CF-1.6
    history:      2020-10-02 09:43:15 UTC+1000 by era5_replication_tools-1.2....
    license:      Licence to use Copernicus Products: https://apps.ecmwf.int/...
    summary:      ERA5 is the fifth generation ECMWF atmospheric reanalysis o...
    title:        ERA5 single-levels reanalysis 10m_v_component_of_wind 19920...
━━━━━━━━━━━━━━━━━━━━━━━━━━━━━━━━━━━━━━━━━━━━━━━━━━━━━━━━━━━━━━━━━━━━━━━━━━━━━━━━━━━━━━━━━━━━━━━━━━━━━━━━━━━━━━━━━━━━━━━━━━


┌────────────────────────────────────────────────────────────────────────────────────────────────────────────────────────┐
┊                                                Mon Mar 20 01:05:29 2023                                                ┊
┊                rank ▻ 14                                                                                               ┊
┊                node ▻ gadi-cpu-clx-1632.gadi.nci.org.au                                                                ┊
┊                year ▻ 1993                                                                                             ┊
┊              in_dir ▻ /g/data/rt52/era5/single-levels/reanalysis/10v/1993/*                                            ┊
┊            out_file ▻ /g/data/wb00/admin/testing/nci_5.625/10m_v_component_of_wind/10m_v_component_of_wind_1993_5.625.nc┊
└────────────────────────────────────────────────────────────────────────────────────────────────────────────────────────┘
<xarray.Dataset>
Dimensions:    (longitude: 1440, latitude: 721, time: 8760)
Coordinates:
  * longitude  (longitude) float32 -180.0 -179.8 -179.5 ... 179.2 179.5 179.8
  * latitude   (latitude) float32 90.0 89.75 89.5 89.25 ... -89.5 -89.75 -90.0
  * time       (time) datetime64[ns] 1993-01-01 ... 1993-12-31T23:00:00
Data variables:
    v10        (time, latitude, longitude) float32 dask.array<chunksize=(4, 721, 1440), meta=np.ndarray>
Attributes:
    Conventions:  CF-1.6
    history:      2020-10-02 04:49:33 UTC+1000 by era5_replication_tools-1.2....
    license:      Licence to use Copernicus Products: https://apps.ecmwf.int/...
    summary:      ERA5 is the fifth generation ECMWF atmospheric reanalysis o...
    title:        ERA5 single-levels reanalysis 10m_v_component_of_wind 19930...
━━━━━━━━━━━━━━━━━━━━━━━━━━━━━━━━━━━━━━━━━━━━━━━━━━━━━━━━━━━━━━━━━━━━━━━━━━━━━━━━━━━━━━━━━━━━━━━━━━━━━━━━━━━━━━━━━━━━━━━━━━


┌────────────────────────────────────────────────────────────────────────────────────────────────────────────────────────┐
┊                                                Mon Mar 20 01:05:31 2023                                                ┊
┊                rank ▻ 15                                                                                               ┊
┊                node ▻ gadi-cpu-clx-1632.gadi.nci.org.au                                                                ┊
┊                year ▻ 1994                                                                                             ┊
┊              in_dir ▻ /g/data/rt52/era5/single-levels/reanalysis/10v/1994/*                                            ┊
┊            out_file ▻ /g/data/wb00/admin/testing/nci_5.625/10m_v_component_of_wind/10m_v_component_of_wind_1994_5.625.nc┊
└────────────────────────────────────────────────────────────────────────────────────────────────────────────────────────┘
<xarray.Dataset>
Dimensions:    (longitude: 1440, latitude: 721, time: 8760)
Coordinates:
  * longitude  (longitude) float32 -180.0 -179.8 -179.5 ... 179.2 179.5 179.8
  * latitude   (latitude) float32 90.0 89.75 89.5 89.25 ... -89.5 -89.75 -90.0
  * time       (time) datetime64[ns] 1994-01-01 ... 1994-12-31T23:00:00
Data variables:
    v10        (time, latitude, longitude) float32 dask.array<chunksize=(4, 721, 1440), meta=np.ndarray>
Attributes:
    Conventions:  CF-1.6
    history:      2020-10-02 00:29:32 UTC+1000 by era5_replication_tools-1.2....
    license:      Licence to use Copernicus Products: https://apps.ecmwf.int/...
    summary:      ERA5 is the fifth generation ECMWF atmospheric reanalysis o...
    title:        ERA5 single-levels reanalysis 10m_v_component_of_wind 19940...
━━━━━━━━━━━━━━━━━━━━━━━━━━━━━━━━━━━━━━━━━━━━━━━━━━━━━━━━━━━━━━━━━━━━━━━━━━━━━━━━━━━━━━━━━━━━━━━━━━━━━━━━━━━━━━━━━━━━━━━━━━


┌────────────────────────────────────────────────────────────────────────────────────────────────────────────────────────┐
┊                                                Mon Mar 20 01:05:33 2023                                                ┊
┊                rank ▻ 16                                                                                               ┊
┊                node ▻ gadi-cpu-clx-1633.gadi.nci.org.au                                                                ┊
┊                year ▻ 1995                                                                                             ┊
┊              in_dir ▻ /g/data/rt52/era5/single-levels/reanalysis/10v/1995/*                                            ┊
┊            out_file ▻ /g/data/wb00/admin/testing/nci_5.625/10m_v_component_of_wind/10m_v_component_of_wind_1995_5.625.nc┊
└────────────────────────────────────────────────────────────────────────────────────────────────────────────────────────┘
<xarray.Dataset>
Dimensions:    (longitude: 1440, latitude: 721, time: 8760)
Coordinates:
  * longitude  (longitude) float32 -180.0 -179.8 -179.5 ... 179.2 179.5 179.8
  * latitude   (latitude) float32 90.0 89.75 89.5 89.25 ... -89.5 -89.75 -90.0
  * time       (time) datetime64[ns] 1995-01-01 ... 1995-12-31T23:00:00
Data variables:
    v10        (time, latitude, longitude) float32 dask.array<chunksize=(4, 721, 1440), meta=np.ndarray>
Attributes:
    Conventions:  CF-1.6
    history:      2020-10-01 20:15:38 UTC+1000 by era5_replication_tools-1.2....
    license:      Licence to use Copernicus Products: https://apps.ecmwf.int/...
    summary:      ERA5 is the fifth generation ECMWF atmospheric reanalysis o...
    title:        ERA5 single-levels reanalysis 10m_v_component_of_wind 19950...
━━━━━━━━━━━━━━━━━━━━━━━━━━━━━━━━━━━━━━━━━━━━━━━━━━━━━━━━━━━━━━━━━━━━━━━━━━━━━━━━━━━━━━━━━━━━━━━━━━━━━━━━━━━━━━━━━━━━━━━━━━


┌────────────────────────────────────────────────────────────────────────────────────────────────────────────────────────┐
┊                                                Mon Mar 20 01:05:35 2023                                                ┊
┊                rank ▻ 17                                                                                               ┊
┊                node ▻ gadi-cpu-clx-1633.gadi.nci.org.au                                                                ┊
┊                year ▻ 1996                                                                                             ┊
┊              in_dir ▻ /g/data/rt52/era5/single-levels/reanalysis/10v/1996/*                                            ┊
┊            out_file ▻ /g/data/wb00/admin/testing/nci_5.625/10m_v_component_of_wind/10m_v_component_of_wind_1996_5.625.nc┊
└────────────────────────────────────────────────────────────────────────────────────────────────────────────────────────┘
<xarray.Dataset>
Dimensions:    (longitude: 1440, latitude: 721, time: 8784)
Coordinates:
  * longitude  (longitude) float32 -180.0 -179.8 -179.5 ... 179.2 179.5 179.8
  * latitude   (latitude) float32 90.0 89.75 89.5 89.25 ... -89.5 -89.75 -90.0
  * time       (time) datetime64[ns] 1996-01-01 ... 1996-12-31T23:00:00
Data variables:
    v10        (time, latitude, longitude) float32 dask.array<chunksize=(4, 721, 1440), meta=np.ndarray>
Attributes:
    Conventions:  CF-1.6
    history:      2020-10-01 15:00:04 UTC+1000 by era5_replication_tools-1.2....
    license:      Licence to use Copernicus Products: https://apps.ecmwf.int/...
    summary:      ERA5 is the fifth generation ECMWF atmospheric reanalysis o...
    title:        ERA5 single-levels reanalysis 10m_v_component_of_wind 19960...
━━━━━━━━━━━━━━━━━━━━━━━━━━━━━━━━━━━━━━━━━━━━━━━━━━━━━━━━━━━━━━━━━━━━━━━━━━━━━━━━━━━━━━━━━━━━━━━━━━━━━━━━━━━━━━━━━━━━━━━━━━


┌────────────────────────────────────────────────────────────────────────────────────────────────────────────────────────┐
┊                                                Mon Mar 20 01:05:37 2023                                                ┊
┊                rank ▻ 18                                                                                               ┊
┊                node ▻ gadi-cpu-clx-1633.gadi.nci.org.au                                                                ┊
┊                year ▻ 1997                                                                                             ┊
┊              in_dir ▻ /g/data/rt52/era5/single-levels/reanalysis/10v/1997/*                                            ┊
┊            out_file ▻ /g/data/wb00/admin/testing/nci_5.625/10m_v_component_of_wind/10m_v_component_of_wind_1997_5.625.nc┊
└────────────────────────────────────────────────────────────────────────────────────────────────────────────────────────┘
<xarray.Dataset>
Dimensions:    (longitude: 1440, latitude: 721, time: 8760)
Coordinates:
  * longitude  (longitude) float32 -180.0 -179.8 -179.5 ... 179.2 179.5 179.8
  * latitude   (latitude) float32 90.0 89.75 89.5 89.25 ... -89.5 -89.75 -90.0
  * time       (time) datetime64[ns] 1997-01-01 ... 1997-12-31T23:00:00
Data variables:
    v10        (time, latitude, longitude) float32 dask.array<chunksize=(4, 721, 1440), meta=np.ndarray>
Attributes:
    Conventions:  CF-1.6
    history:      2020-10-01 11:29:58 UTC+1000 by era5_replication_tools-1.2....
    license:      Licence to use Copernicus Products: https://apps.ecmwf.int/...
    summary:      ERA5 is the fifth generation ECMWF atmospheric reanalysis o...
    title:        ERA5 single-levels reanalysis 10m_v_component_of_wind 19970...
━━━━━━━━━━━━━━━━━━━━━━━━━━━━━━━━━━━━━━━━━━━━━━━━━━━━━━━━━━━━━━━━━━━━━━━━━━━━━━━━━━━━━━━━━━━━━━━━━━━━━━━━━━━━━━━━━━━━━━━━━━


┌────────────────────────────────────────────────────────────────────────────────────────────────────────────────────────┐
┊                                                Mon Mar 20 01:05:39 2023                                                ┊
┊                rank ▻ 19                                                                                               ┊
┊                node ▻ gadi-cpu-clx-1633.gadi.nci.org.au                                                                ┊
┊                year ▻ 1998                                                                                             ┊
┊              in_dir ▻ /g/data/rt52/era5/single-levels/reanalysis/10v/1998/*                                            ┊
┊            out_file ▻ /g/data/wb00/admin/testing/nci_5.625/10m_v_component_of_wind/10m_v_component_of_wind_1998_5.625.nc┊
└────────────────────────────────────────────────────────────────────────────────────────────────────────────────────────┘
<xarray.Dataset>
Dimensions:    (longitude: 1440, latitude: 721, time: 8760)
Coordinates:
  * longitude  (longitude) float32 -180.0 -179.8 -179.5 ... 179.2 179.5 179.8
  * latitude   (latitude) float32 90.0 89.75 89.5 89.25 ... -89.5 -89.75 -90.0
  * time       (time) datetime64[ns] 1998-01-01 ... 1998-12-31T23:00:00
Data variables:
    v10        (time, latitude, longitude) float32 dask.array<chunksize=(4, 721, 1440), meta=np.ndarray>
Attributes:
    Conventions:  CF-1.6
    history:      2020-10-01 07:33:50 UTC+1000 by era5_replication_tools-1.2....
    license:      Licence to use Copernicus Products: https://apps.ecmwf.int/...
    summary:      ERA5 is the fifth generation ECMWF atmospheric reanalysis o...
    title:        ERA5 single-levels reanalysis 10m_v_component_of_wind 19980...
━━━━━━━━━━━━━━━━━━━━━━━━━━━━━━━━━━━━━━━━━━━━━━━━━━━━━━━━━━━━━━━━━━━━━━━━━━━━━━━━━━━━━━━━━━━━━━━━━━━━━━━━━━━━━━━━━━━━━━━━━━


┌────────────────────────────────────────────────────────────────────────────────────────────────────────────────────────┐
┊                                                Mon Mar 20 01:05:41 2023                                                ┊
┊                rank ▻ 20                                                                                               ┊
┊                node ▻ gadi-cpu-clx-1635.gadi.nci.org.au                                                                ┊
┊                year ▻ 1999                                                                                             ┊
┊              in_dir ▻ /g/data/rt52/era5/single-levels/reanalysis/10v/1999/*                                            ┊
┊            out_file ▻ /g/data/wb00/admin/testing/nci_5.625/10m_v_component_of_wind/10m_v_component_of_wind_1999_5.625.nc┊
└────────────────────────────────────────────────────────────────────────────────────────────────────────────────────────┘
<xarray.Dataset>
Dimensions:    (longitude: 1440, latitude: 721, time: 8760)
Coordinates:
  * longitude  (longitude) float32 -180.0 -179.8 -179.5 ... 179.2 179.5 179.8
  * latitude   (latitude) float32 90.0 89.75 89.5 89.25 ... -89.5 -89.75 -90.0
  * time       (time) datetime64[ns] 1999-01-01 ... 1999-12-31T23:00:00
Data variables:
    v10        (time, latitude, longitude) float32 dask.array<chunksize=(4, 721, 1440), meta=np.ndarray>
Attributes:
    Conventions:  CF-1.6
    history:      2020-10-01 02:21:20 UTC+1000 by era5_replication_tools-1.2....
    license:      Licence to use Copernicus Products: https://apps.ecmwf.int/...
    summary:      ERA5 is the fifth generation ECMWF atmospheric reanalysis o...
    title:        ERA5 single-levels reanalysis 10m_v_component_of_wind 19990...
━━━━━━━━━━━━━━━━━━━━━━━━━━━━━━━━━━━━━━━━━━━━━━━━━━━━━━━━━━━━━━━━━━━━━━━━━━━━━━━━━━━━━━━━━━━━━━━━━━━━━━━━━━━━━━━━━━━━━━━━━━


┌────────────────────────────────────────────────────────────────────────────────────────────────────────────────────────┐
┊                                                Mon Mar 20 01:05:43 2023                                                ┊
┊                rank ▻ 21                                                                                               ┊
┊                node ▻ gadi-cpu-clx-1635.gadi.nci.org.au                                                                ┊
┊                year ▻ 2000                                                                                             ┊
┊              in_dir ▻ /g/data/rt52/era5/single-levels/reanalysis/10v/2000/*                                            ┊
┊            out_file ▻ /g/data/wb00/admin/testing/nci_5.625/10m_v_component_of_wind/10m_v_component_of_wind_2000_5.625.nc┊
└────────────────────────────────────────────────────────────────────────────────────────────────────────────────────────┘
<xarray.Dataset>
Dimensions:    (longitude: 1440, latitude: 721, time: 8784)
Coordinates:
  * longitude  (longitude) float32 -180.0 -179.8 -179.5 ... 179.2 179.5 179.8
  * latitude   (latitude) float32 90.0 89.75 89.5 89.25 ... -89.5 -89.75 -90.0
  * time       (time) datetime64[ns] 2000-01-01 ... 2000-12-31T23:00:00
Data variables:
    v10        (time, latitude, longitude) float32 dask.array<chunksize=(4, 721, 1440), meta=np.ndarray>
Attributes:
    Conventions:  CF-1.6
    history:      2020-09-30 21:45:16 UTC+1000 by era5_replication_tools-1.2....
    license:      Licence to use Copernicus Products: https://apps.ecmwf.int/...
    summary:      ERA5 is the fifth generation ECMWF atmospheric reanalysis o...
    title:        ERA5 single-levels reanalysis 10m_v_component_of_wind 20000...
━━━━━━━━━━━━━━━━━━━━━━━━━━━━━━━━━━━━━━━━━━━━━━━━━━━━━━━━━━━━━━━━━━━━━━━━━━━━━━━━━━━━━━━━━━━━━━━━━━━━━━━━━━━━━━━━━━━━━━━━━━


┌────────────────────────────────────────────────────────────────────────────────────────────────────────────────────────┐
┊                                                Mon Mar 20 01:05:45 2023                                                ┊
┊                rank ▻ 22                                                                                               ┊
┊                node ▻ gadi-cpu-clx-1635.gadi.nci.org.au                                                                ┊
┊                year ▻ 2001                                                                                             ┊
┊              in_dir ▻ /g/data/rt52/era5/single-levels/reanalysis/10v/2001/*                                            ┊
┊            out_file ▻ /g/data/wb00/admin/testing/nci_5.625/10m_v_component_of_wind/10m_v_component_of_wind_2001_5.625.nc┊
└────────────────────────────────────────────────────────────────────────────────────────────────────────────────────────┘
┌────────────────────────────────────────────────────────────────────────────────────────────────────────────────────────┐
┊                                                Mon Mar 20 01:05:47 2023                                                ┊
┊                rank ▻ 23                                                                                               ┊
┊                node ▻ gadi-cpu-clx-1635.gadi.nci.org.au                                                                ┊
┊                year ▻ 2002                                                                                             ┊
┊              in_dir ▻ /g/data/rt52/era5/single-levels/reanalysis/10v/2002/*                                            ┊
┊            out_file ▻ /g/data/wb00/admin/testing/nci_5.625/10m_v_component_of_wind/10m_v_component_of_wind_2002_5.625.nc┊
└────────────────────────────────────────────────────────────────────────────────────────────────────────────────────────┘
<xarray.Dataset>
Dimensions:    (longitude: 1440, latitude: 721, time: 8760)
Coordinates:
  * longitude  (longitude) float32 -180.0 -179.8 -179.5 ... 179.2 179.5 179.8
  * latitude   (latitude) float32 90.0 89.75 89.5 89.25 ... -89.5 -89.75 -90.0
  * time       (time) datetime64[ns] 2001-01-01 ... 2001-12-31T23:00:00
Data variables:
    v10        (time, latitude, longitude) float32 dask.array<chunksize=(4, 721, 1440), meta=np.ndarray>
Attributes:
    Conventions:  CF-1.6
    history:      2020-09-30 15:35:27 UTC+1000 by era5_replication_tools-1.2....
    license:      Licence to use Copernicus Products: https://apps.ecmwf.int/...
    summary:      ERA5 is the fifth generation ECMWF atmospheric reanalysis o...
    title:        ERA5 single-levels reanalysis 10m_v_component_of_wind 20010...
━━━━━━━━━━━━━━━━━━━━━━━━━━━━━━━━━━━━━━━━━━━━━━━━━━━━━━━━━━━━━━━━━━━━━━━━━━━━━━━━━━━━━━━━━━━━━━━━━━━━━━━━━━━━━━━━━━━━━━━━━━


<xarray.Dataset>
Dimensions:    (longitude: 1440, latitude: 721, time: 8760)
Coordinates:
  * longitude  (longitude) float32 -180.0 -179.8 -179.5 ... 179.2 179.5 179.8
  * latitude   (latitude) float32 90.0 89.75 89.5 89.25 ... -89.5 -89.75 -90.0
  * time       (time) datetime64[ns] 2002-01-01 ... 2002-12-31T23:00:00
Data variables:
    v10        (time, latitude, longitude) float32 dask.array<chunksize=(4, 721, 1440), meta=np.ndarray>
Attributes:
    Conventions:  CF-1.6
    history:      2020-09-30 11:50:54 UTC+1000 by era5_replication_tools-1.2....
    license:      Licence to use Copernicus Products: https://apps.ecmwf.int/...
    summary:      ERA5 is the fifth generation ECMWF atmospheric reanalysis o...
    title:        ERA5 single-levels reanalysis 10m_v_component_of_wind 20020...
━━━━━━━━━━━━━━━━━━━━━━━━━━━━━━━━━━━━━━━━━━━━━━━━━━━━━━━━━━━━━━━━━━━━━━━━━━━━━━━━━━━━━━━━━━━━━━━━━━━━━━━━━━━━━━━━━━━━━━━━━━


┌────────────────────────────────────────────────────────────────────────────────────────────────────────────────────────┐
┊                                                Mon Mar 20 01:05:49 2023                                                ┊
┊                rank ▻ 24                                                                                               ┊
┊                node ▻ gadi-cpu-clx-1637.gadi.nci.org.au                                                                ┊
┊                year ▻ 2003                                                                                             ┊
┊              in_dir ▻ /g/data/rt52/era5/single-levels/reanalysis/10v/2003/*                                            ┊
┊            out_file ▻ /g/data/wb00/admin/testing/nci_5.625/10m_v_component_of_wind/10m_v_component_of_wind_2003_5.625.nc┊
└────────────────────────────────────────────────────────────────────────────────────────────────────────────────────────┘
<xarray.Dataset>
Dimensions:    (longitude: 1440, latitude: 721, time: 8760)
Coordinates:
  * longitude  (longitude) float32 -180.0 -179.8 -179.5 ... 179.2 179.5 179.8
  * latitude   (latitude) float32 90.0 89.75 89.5 89.25 ... -89.5 -89.75 -90.0
  * time       (time) datetime64[ns] 2003-01-01 ... 2003-12-31T23:00:00
Data variables:
    v10        (time, latitude, longitude) float32 dask.array<chunksize=(4, 721, 1440), meta=np.ndarray>
Attributes:
    Conventions:  CF-1.6
    history:      2020-09-30 07:17:07 UTC+1000 by era5_replication_tools-1.2....
    license:      Licence to use Copernicus Products: https://apps.ecmwf.int/...
    summary:      ERA5 is the fifth generation ECMWF atmospheric reanalysis o...
    title:        ERA5 single-levels reanalysis 10m_v_component_of_wind 20030...
━━━━━━━━━━━━━━━━━━━━━━━━━━━━━━━━━━━━━━━━━━━━━━━━━━━━━━━━━━━━━━━━━━━━━━━━━━━━━━━━━━━━━━━━━━━━━━━━━━━━━━━━━━━━━━━━━━━━━━━━━━


┌────────────────────────────────────────────────────────────────────────────────────────────────────────────────────────┐
┊                                                Mon Mar 20 01:05:51 2023                                                ┊
┊                rank ▻ 25                                                                                               ┊
┊                node ▻ gadi-cpu-clx-1637.gadi.nci.org.au                                                                ┊
┊                year ▻ 2004                                                                                             ┊
┊              in_dir ▻ /g/data/rt52/era5/single-levels/reanalysis/10v/2004/*                                            ┊
┊            out_file ▻ /g/data/wb00/admin/testing/nci_5.625/10m_v_component_of_wind/10m_v_component_of_wind_2004_5.625.nc┊
└────────────────────────────────────────────────────────────────────────────────────────────────────────────────────────┘
<xarray.Dataset>
Dimensions:    (longitude: 1440, latitude: 721, time: 8784)
Coordinates:
  * longitude  (longitude) float32 -180.0 -179.8 -179.5 ... 179.2 179.5 179.8
  * latitude   (latitude) float32 90.0 89.75 89.5 89.25 ... -89.5 -89.75 -90.0
  * time       (time) datetime64[ns] 2004-01-01 ... 2004-12-31T23:00:00
Data variables:
    v10        (time, latitude, longitude) float32 dask.array<chunksize=(4, 721, 1440), meta=np.ndarray>
Attributes:
    Conventions:  CF-1.6
    history:      2020-09-30 01:14:42 UTC+1000 by era5_replication_tools-1.2....
    license:      Licence to use Copernicus Products: https://apps.ecmwf.int/...
    summary:      ERA5 is the fifth generation ECMWF atmospheric reanalysis o...
    title:        ERA5 single-levels reanalysis 10m_v_component_of_wind 20040...
━━━━━━━━━━━━━━━━━━━━━━━━━━━━━━━━━━━━━━━━━━━━━━━━━━━━━━━━━━━━━━━━━━━━━━━━━━━━━━━━━━━━━━━━━━━━━━━━━━━━━━━━━━━━━━━━━━━━━━━━━━


┌────────────────────────────────────────────────────────────────────────────────────────────────────────────────────────┐
┊                                                Mon Mar 20 01:05:53 2023                                                ┊
┊                rank ▻ 26                                                                                               ┊
┊                node ▻ gadi-cpu-clx-1637.gadi.nci.org.au                                                                ┊
┊                year ▻ 2005                                                                                             ┊
┊              in_dir ▻ /g/data/rt52/era5/single-levels/reanalysis/10v/2005/*                                            ┊
┊            out_file ▻ /g/data/wb00/admin/testing/nci_5.625/10m_v_component_of_wind/10m_v_component_of_wind_2005_5.625.nc┊
└────────────────────────────────────────────────────────────────────────────────────────────────────────────────────────┘
<xarray.Dataset>
Dimensions:    (longitude: 1440, latitude: 721, time: 8760)
Coordinates:
  * longitude  (longitude) float32 -180.0 -179.8 -179.5 ... 179.2 179.5 179.8
  * latitude   (latitude) float32 90.0 89.75 89.5 89.25 ... -89.5 -89.75 -90.0
  * time       (time) datetime64[ns] 2005-01-01 ... 2005-12-31T23:00:00
Data variables:
    v10        (time, latitude, longitude) float32 dask.array<chunksize=(4, 721, 1440), meta=np.ndarray>
Attributes:
    Conventions:  CF-1.6
    history:      2020-09-29 17:25:02 UTC+1000 by era5_replication_tools-1.2....
    license:      Licence to use Copernicus Products: https://apps.ecmwf.int/...
    summary:      ERA5 is the fifth generation ECMWF atmospheric reanalysis o...
    title:        ERA5 single-levels reanalysis 10m_v_component_of_wind 20050...
━━━━━━━━━━━━━━━━━━━━━━━━━━━━━━━━━━━━━━━━━━━━━━━━━━━━━━━━━━━━━━━━━━━━━━━━━━━━━━━━━━━━━━━━━━━━━━━━━━━━━━━━━━━━━━━━━━━━━━━━━━


┌────────────────────────────────────────────────────────────────────────────────────────────────────────────────────────┐
┊                                                Mon Mar 20 01:05:55 2023                                                ┊
┊                rank ▻ 27                                                                                               ┊
┊                node ▻ gadi-cpu-clx-1637.gadi.nci.org.au                                                                ┊
┊                year ▻ 2006                                                                                             ┊
┊              in_dir ▻ /g/data/rt52/era5/single-levels/reanalysis/10v/2006/*                                            ┊
┊            out_file ▻ /g/data/wb00/admin/testing/nci_5.625/10m_v_component_of_wind/10m_v_component_of_wind_2006_5.625.nc┊
└────────────────────────────────────────────────────────────────────────────────────────────────────────────────────────┘
┌────────────────────────────────────────────────────────────────────────────────────────────────────────────────────────┐
┊                                                Mon Mar 20 01:05:57 2023                                                ┊
┊                rank ▻ 28                                                                                               ┊
┊                node ▻ gadi-cpu-clx-1638.gadi.nci.org.au                                                                ┊
┊                year ▻ 2007                                                                                             ┊
┊              in_dir ▻ /g/data/rt52/era5/single-levels/reanalysis/10v/2007/*                                            ┊
┊            out_file ▻ /g/data/wb00/admin/testing/nci_5.625/10m_v_component_of_wind/10m_v_component_of_wind_2007_5.625.nc┊
└────────────────────────────────────────────────────────────────────────────────────────────────────────────────────────┘
<xarray.Dataset>
Dimensions:    (longitude: 1440, latitude: 721, time: 8760)
Coordinates:
  * longitude  (longitude) float32 -180.0 -179.8 -179.5 ... 179.2 179.5 179.8
  * latitude   (latitude) float32 90.0 89.75 89.5 89.25 ... -89.5 -89.75 -90.0
  * time       (time) datetime64[ns] 2006-01-01 ... 2006-12-31T23:00:00
Data variables:
    v10        (time, latitude, longitude) float32 dask.array<chunksize=(4, 721, 1440), meta=np.ndarray>
Attributes:
    Conventions:  CF-1.6
    history:      2020-09-29 12:17:10 UTC+1000 by era5_replication_tools-1.2....
    license:      Licence to use Copernicus Products: https://apps.ecmwf.int/...
    summary:      ERA5 is the fifth generation ECMWF atmospheric reanalysis o...
    title:        ERA5 single-levels reanalysis 10m_v_component_of_wind 20060...
━━━━━━━━━━━━━━━━━━━━━━━━━━━━━━━━━━━━━━━━━━━━━━━━━━━━━━━━━━━━━━━━━━━━━━━━━━━━━━━━━━━━━━━━━━━━━━━━━━━━━━━━━━━━━━━━━━━━━━━━━━


<xarray.Dataset>
Dimensions:    (longitude: 1440, latitude: 721, time: 8760)
Coordinates:
  * longitude  (longitude) float32 -180.0 -179.8 -179.5 ... 179.2 179.5 179.8
  * latitude   (latitude) float32 90.0 89.75 89.5 89.25 ... -89.5 -89.75 -90.0
  * time       (time) datetime64[ns] 2007-01-01 ... 2007-12-31T23:00:00
Data variables:
    v10        (time, latitude, longitude) float32 dask.array<chunksize=(4, 721, 1440), meta=np.ndarray>
Attributes:
    Conventions:  CF-1.6
    history:      2020-09-29 06:57:08 UTC+1000 by era5_replication_tools-1.2....
    license:      Licence to use Copernicus Products: https://apps.ecmwf.int/...
    summary:      ERA5 is the fifth generation ECMWF atmospheric reanalysis o...
    title:        ERA5 single-levels reanalysis 10m_v_component_of_wind 20070...
━━━━━━━━━━━━━━━━━━━━━━━━━━━━━━━━━━━━━━━━━━━━━━━━━━━━━━━━━━━━━━━━━━━━━━━━━━━━━━━━━━━━━━━━━━━━━━━━━━━━━━━━━━━━━━━━━━━━━━━━━━


┌────────────────────────────────────────────────────────────────────────────────────────────────────────────────────────┐
┊                                                Mon Mar 20 01:05:59 2023                                                ┊
┊                rank ▻ 29                                                                                               ┊
┊                node ▻ gadi-cpu-clx-1638.gadi.nci.org.au                                                                ┊
┊                year ▻ 2008                                                                                             ┊
┊              in_dir ▻ /g/data/rt52/era5/single-levels/reanalysis/10v/2008/*                                            ┊
┊            out_file ▻ /g/data/wb00/admin/testing/nci_5.625/10m_v_component_of_wind/10m_v_component_of_wind_2008_5.625.nc┊
└────────────────────────────────────────────────────────────────────────────────────────────────────────────────────────┘
<xarray.Dataset>
Dimensions:    (longitude: 1440, latitude: 721, time: 8784)
Coordinates:
  * longitude  (longitude) float32 -180.0 -179.8 -179.5 ... 179.2 179.5 179.8
  * latitude   (latitude) float32 90.0 89.75 89.5 89.25 ... -89.5 -89.75 -90.0
  * time       (time) datetime64[ns] 2008-01-01 ... 2008-12-31T23:00:00
Data variables:
    v10        (time, latitude, longitude) float32 dask.array<chunksize=(4, 721, 1440), meta=np.ndarray>
Attributes:
    Conventions:  CF-1.6
    history:      2020-09-28 22:30:37 UTC+1000 by era5_replication_tools-1.2....
    license:      Licence to use Copernicus Products: https://apps.ecmwf.int/...
    summary:      ERA5 is the fifth generation ECMWF atmospheric reanalysis o...
    title:        ERA5 single-levels reanalysis 10m_v_component_of_wind 20080...
━━━━━━━━━━━━━━━━━━━━━━━━━━━━━━━━━━━━━━━━━━━━━━━━━━━━━━━━━━━━━━━━━━━━━━━━━━━━━━━━━━━━━━━━━━━━━━━━━━━━━━━━━━━━━━━━━━━━━━━━━━


┌────────────────────────────────────────────────────────────────────────────────────────────────────────────────────────┐
┊                                                Mon Mar 20 01:06:01 2023                                                ┊
┊                rank ▻ 30                                                                                               ┊
┊                node ▻ gadi-cpu-clx-1638.gadi.nci.org.au                                                                ┊
┊                year ▻ 2009                                                                                             ┊
┊              in_dir ▻ /g/data/rt52/era5/single-levels/reanalysis/10v/2009/*                                            ┊
┊            out_file ▻ /g/data/wb00/admin/testing/nci_5.625/10m_v_component_of_wind/10m_v_component_of_wind_2009_5.625.nc┊
└────────────────────────────────────────────────────────────────────────────────────────────────────────────────────────┘
<xarray.Dataset>
Dimensions:    (longitude: 1440, latitude: 721, time: 8760)
Coordinates:
  * longitude  (longitude) float32 -180.0 -179.8 -179.5 ... 179.2 179.5 179.8
  * latitude   (latitude) float32 90.0 89.75 89.5 89.25 ... -89.5 -89.75 -90.0
  * time       (time) datetime64[ns] 2009-01-01 ... 2009-12-31T23:00:00
Data variables:
    v10        (time, latitude, longitude) float32 dask.array<chunksize=(4, 721, 1440), meta=np.ndarray>
Attributes:
    Conventions:  CF-1.6
    history:      2020-09-28 17:31:53 UTC+1000 by era5_replication_tools-1.2....
    license:      Licence to use Copernicus Products: https://apps.ecmwf.int/...
    summary:      ERA5 is the fifth generation ECMWF atmospheric reanalysis o...
    title:        ERA5 single-levels reanalysis 10m_v_component_of_wind 20090...
━━━━━━━━━━━━━━━━━━━━━━━━━━━━━━━━━━━━━━━━━━━━━━━━━━━━━━━━━━━━━━━━━━━━━━━━━━━━━━━━━━━━━━━━━━━━━━━━━━━━━━━━━━━━━━━━━━━━━━━━━━


┌────────────────────────────────────────────────────────────────────────────────────────────────────────────────────────┐
┊                                                Mon Mar 20 01:06:03 2023                                                ┊
┊                rank ▻ 31                                                                                               ┊
┊                node ▻ gadi-cpu-clx-1638.gadi.nci.org.au                                                                ┊
┊                year ▻ 2010                                                                                             ┊
┊              in_dir ▻ /g/data/rt52/era5/single-levels/reanalysis/10v/2010/*                                            ┊
┊            out_file ▻ /g/data/wb00/admin/testing/nci_5.625/10m_v_component_of_wind/10m_v_component_of_wind_2010_5.625.nc┊
└────────────────────────────────────────────────────────────────────────────────────────────────────────────────────────┘
<xarray.Dataset>
Dimensions:    (longitude: 1440, latitude: 721, time: 8760)
Coordinates:
  * longitude  (longitude) float32 -180.0 -179.8 -179.5 ... 179.2 179.5 179.8
  * latitude   (latitude) float32 90.0 89.75 89.5 89.25 ... -89.5 -89.75 -90.0
  * time       (time) datetime64[ns] 2010-01-01 ... 2010-12-31T23:00:00
Data variables:
    v10        (time, latitude, longitude) float32 dask.array<chunksize=(4, 721, 1440), meta=np.ndarray>
Attributes:
    Conventions:  CF-1.6
    history:      2020-09-28 12:40:15 UTC+1000 by era5_replication_tools-1.2....
    license:      Licence to use Copernicus Products: https://apps.ecmwf.int/...
    summary:      ERA5 is the fifth generation ECMWF atmospheric reanalysis o...
    title:        ERA5 single-levels reanalysis 10m_v_component_of_wind 20100...
━━━━━━━━━━━━━━━━━━━━━━━━━━━━━━━━━━━━━━━━━━━━━━━━━━━━━━━━━━━━━━━━━━━━━━━━━━━━━━━━━━━━━━━━━━━━━━━━━━━━━━━━━━━━━━━━━━━━━━━━━━


┌────────────────────────────────────────────────────────────────────────────────────────────────────────────────────────┐
┊                                                Mon Mar 20 01:06:05 2023                                                ┊
┊                rank ▻ 32                                                                                               ┊
┊                node ▻ gadi-cpu-clx-1639.gadi.nci.org.au                                                                ┊
┊                year ▻ 2011                                                                                             ┊
┊              in_dir ▻ /g/data/rt52/era5/single-levels/reanalysis/10v/2011/*                                            ┊
┊            out_file ▻ /g/data/wb00/admin/testing/nci_5.625/10m_v_component_of_wind/10m_v_component_of_wind_2011_5.625.nc┊
└────────────────────────────────────────────────────────────────────────────────────────────────────────────────────────┘
<xarray.Dataset>
Dimensions:    (longitude: 1440, latitude: 721, time: 8760)
Coordinates:
  * longitude  (longitude) float32 -180.0 -179.8 -179.5 ... 179.2 179.5 179.8
  * latitude   (latitude) float32 90.0 89.75 89.5 89.25 ... -89.5 -89.75 -90.0
  * time       (time) datetime64[ns] 2011-01-01 ... 2011-12-31T23:00:00
Data variables:
    v10        (time, latitude, longitude) float32 dask.array<chunksize=(4, 721, 1440), meta=np.ndarray>
Attributes:
    Conventions:  CF-1.6
    history:      2020-09-28 08:39:59 UTC+1000 by era5_replication_tools-1.2....
    license:      Licence to use Copernicus Products: https://apps.ecmwf.int/...
    summary:      ERA5 is the fifth generation ECMWF atmospheric reanalysis o...
    title:        ERA5 single-levels reanalysis 10m_v_component_of_wind 20110...
━━━━━━━━━━━━━━━━━━━━━━━━━━━━━━━━━━━━━━━━━━━━━━━━━━━━━━━━━━━━━━━━━━━━━━━━━━━━━━━━━━━━━━━━━━━━━━━━━━━━━━━━━━━━━━━━━━━━━━━━━━


┌────────────────────────────────────────────────────────────────────────────────────────────────────────────────────────┐
┊                                                Mon Mar 20 01:06:07 2023                                                ┊
┊                rank ▻ 33                                                                                               ┊
┊                node ▻ gadi-cpu-clx-1639.gadi.nci.org.au                                                                ┊
┊                year ▻ 2012                                                                                             ┊
┊              in_dir ▻ /g/data/rt52/era5/single-levels/reanalysis/10v/2012/*                                            ┊
┊            out_file ▻ /g/data/wb00/admin/testing/nci_5.625/10m_v_component_of_wind/10m_v_component_of_wind_2012_5.625.nc┊
└────────────────────────────────────────────────────────────────────────────────────────────────────────────────────────┘
<xarray.Dataset>
Dimensions:    (longitude: 1440, latitude: 721, time: 8784)
Coordinates:
  * longitude  (longitude) float32 -180.0 -179.8 -179.5 ... 179.2 179.5 179.8
  * latitude   (latitude) float32 90.0 89.75 89.5 89.25 ... -89.5 -89.75 -90.0
  * time       (time) datetime64[ns] 2012-01-01 ... 2012-12-31T23:00:00
Data variables:
    v10        (time, latitude, longitude) float32 dask.array<chunksize=(4, 721, 1440), meta=np.ndarray>
Attributes:
    Conventions:  CF-1.6
    history:      2020-09-28 03:25:07 UTC+1000 by era5_replication_tools-1.2....
    license:      Licence to use Copernicus Products: https://apps.ecmwf.int/...
    summary:      ERA5 is the fifth generation ECMWF atmospheric reanalysis o...
    title:        ERA5 single-levels reanalysis 10m_v_component_of_wind 20120...
━━━━━━━━━━━━━━━━━━━━━━━━━━━━━━━━━━━━━━━━━━━━━━━━━━━━━━━━━━━━━━━━━━━━━━━━━━━━━━━━━━━━━━━━━━━━━━━━━━━━━━━━━━━━━━━━━━━━━━━━━━


┌────────────────────────────────────────────────────────────────────────────────────────────────────────────────────────┐
┊                                                Mon Mar 20 01:06:09 2023                                                ┊
┊                rank ▻ 34                                                                                               ┊
┊                node ▻ gadi-cpu-clx-1639.gadi.nci.org.au                                                                ┊
┊                year ▻ 2013                                                                                             ┊
┊              in_dir ▻ /g/data/rt52/era5/single-levels/reanalysis/10v/2013/*                                            ┊
┊            out_file ▻ /g/data/wb00/admin/testing/nci_5.625/10m_v_component_of_wind/10m_v_component_of_wind_2013_5.625.nc┊
└────────────────────────────────────────────────────────────────────────────────────────────────────────────────────────┘
┌────────────────────────────────────────────────────────────────────────────────────────────────────────────────────────┐
┊                                                Mon Mar 20 01:06:11 2023                                                ┊
┊                rank ▻ 35                                                                                               ┊
┊                node ▻ gadi-cpu-clx-1639.gadi.nci.org.au                                                                ┊
┊                year ▻ 2014                                                                                             ┊
┊              in_dir ▻ /g/data/rt52/era5/single-levels/reanalysis/10v/2014/*                                            ┊
┊            out_file ▻ /g/data/wb00/admin/testing/nci_5.625/10m_v_component_of_wind/10m_v_component_of_wind_2014_5.625.nc┊
└────────────────────────────────────────────────────────────────────────────────────────────────────────────────────────┘
<xarray.Dataset>
Dimensions:    (longitude: 1440, latitude: 721, time: 8760)
Coordinates:
  * longitude  (longitude) float32 -180.0 -179.8 -179.5 ... 179.2 179.5 179.8
  * latitude   (latitude) float32 90.0 89.75 89.5 89.25 ... -89.5 -89.75 -90.0
  * time       (time) datetime64[ns] 2013-01-01 ... 2013-12-31T23:00:00
Data variables:
    v10        (time, latitude, longitude) float32 dask.array<chunksize=(4, 721, 1440), meta=np.ndarray>
Attributes:
    Conventions:  CF-1.6
    history:      2020-09-27 23:35:12 UTC+1000 by era5_replication_tools-1.2....
    license:      Licence to use Copernicus Products: https://apps.ecmwf.int/...
    summary:      ERA5 is the fifth generation ECMWF atmospheric reanalysis o...
    title:        ERA5 single-levels reanalysis 10m_v_component_of_wind 20130...
━━━━━━━━━━━━━━━━━━━━━━━━━━━━━━━━━━━━━━━━━━━━━━━━━━━━━━━━━━━━━━━━━━━━━━━━━━━━━━━━━━━━━━━━━━━━━━━━━━━━━━━━━━━━━━━━━━━━━━━━━━


<xarray.Dataset>
Dimensions:    (longitude: 1440, latitude: 721, time: 8760)
Coordinates:
  * longitude  (longitude) float32 -180.0 -179.8 -179.5 ... 179.2 179.5 179.8
  * latitude   (latitude) float32 90.0 89.75 89.5 89.25 ... -89.5 -89.75 -90.0
  * time       (time) datetime64[ns] 2014-01-01 ... 2014-12-31T23:00:00
Data variables:
    v10        (time, latitude, longitude) float32 dask.array<chunksize=(4, 721, 1440), meta=np.ndarray>
Attributes:
    Conventions:  CF-1.6
    history:      2020-09-27 19:18:00 UTC+1000 by era5_replication_tools-1.2....
    license:      Licence to use Copernicus Products: https://apps.ecmwf.int/...
    summary:      ERA5 is the fifth generation ECMWF atmospheric reanalysis o...
    title:        ERA5 single-levels reanalysis 10m_v_component_of_wind 20140...
━━━━━━━━━━━━━━━━━━━━━━━━━━━━━━━━━━━━━━━━━━━━━━━━━━━━━━━━━━━━━━━━━━━━━━━━━━━━━━━━━━━━━━━━━━━━━━━━━━━━━━━━━━━━━━━━━━━━━━━━━━


┌────────────────────────────────────────────────────────────────────────────────────────────────────────────────────────┐
┊                                                Mon Mar 20 01:06:13 2023                                                ┊
┊                rank ▻ 36                                                                                               ┊
┊                node ▻ gadi-cpu-clx-1640.gadi.nci.org.au                                                                ┊
┊                year ▻ 2015                                                                                             ┊
┊              in_dir ▻ /g/data/rt52/era5/single-levels/reanalysis/10v/2015/*                                            ┊
┊            out_file ▻ /g/data/wb00/admin/testing/nci_5.625/10m_v_component_of_wind/10m_v_component_of_wind_2015_5.625.nc┊
└────────────────────────────────────────────────────────────────────────────────────────────────────────────────────────┘
<xarray.Dataset>
Dimensions:    (longitude: 1440, latitude: 721, time: 8760)
Coordinates:
  * longitude  (longitude) float32 -180.0 -179.8 -179.5 ... 179.2 179.5 179.8
  * latitude   (latitude) float32 90.0 89.75 89.5 89.25 ... -89.5 -89.75 -90.0
  * time       (time) datetime64[ns] 2015-01-01 ... 2015-12-31T23:00:00
Data variables:
    v10        (time, latitude, longitude) float32 dask.array<chunksize=(4, 721, 1440), meta=np.ndarray>
Attributes:
    Conventions:  CF-1.6
    history:      2020-09-27 14:10:26 UTC+1000 by era5_replication_tools-1.2....
    license:      Licence to use Copernicus Products: https://apps.ecmwf.int/...
    summary:      ERA5 is the fifth generation ECMWF atmospheric reanalysis o...
    title:        ERA5 single-levels reanalysis 10m_v_component_of_wind 20150...
━━━━━━━━━━━━━━━━━━━━━━━━━━━━━━━━━━━━━━━━━━━━━━━━━━━━━━━━━━━━━━━━━━━━━━━━━━━━━━━━━━━━━━━━━━━━━━━━━━━━━━━━━━━━━━━━━━━━━━━━━━


┌────────────────────────────────────────────────────────────────────────────────────────────────────────────────────────┐
┊                                                Mon Mar 20 01:06:15 2023                                                ┊
┊                rank ▻ 37                                                                                               ┊
┊                node ▻ gadi-cpu-clx-1640.gadi.nci.org.au                                                                ┊
┊                year ▻ 2016                                                                                             ┊
┊              in_dir ▻ /g/data/rt52/era5/single-levels/reanalysis/10v/2016/*                                            ┊
┊            out_file ▻ /g/data/wb00/admin/testing/nci_5.625/10m_v_component_of_wind/10m_v_component_of_wind_2016_5.625.nc┊
└────────────────────────────────────────────────────────────────────────────────────────────────────────────────────────┘
<xarray.Dataset>
Dimensions:    (longitude: 1440, latitude: 721, time: 8784)
Coordinates:
  * longitude  (longitude) float32 -180.0 -179.8 -179.5 ... 179.2 179.5 179.8
  * latitude   (latitude) float32 90.0 89.75 89.5 89.25 ... -89.5 -89.75 -90.0
  * time       (time) datetime64[ns] 2016-01-01 ... 2016-12-31T23:00:00
Data variables:
    v10        (time, latitude, longitude) float32 dask.array<chunksize=(4, 721, 1440), meta=np.ndarray>
Attributes:
    Conventions:  CF-1.6
    history:      2020-09-27 09:40:17 UTC+1000 by era5_replication_tools-1.2....
    license:      Licence to use Copernicus Products: https://apps.ecmwf.int/...
    summary:      ERA5 is the fifth generation ECMWF atmospheric reanalysis o...
    title:        ERA5 single-levels reanalysis 10m_v_component_of_wind 20160...
━━━━━━━━━━━━━━━━━━━━━━━━━━━━━━━━━━━━━━━━━━━━━━━━━━━━━━━━━━━━━━━━━━━━━━━━━━━━━━━━━━━━━━━━━━━━━━━━━━━━━━━━━━━━━━━━━━━━━━━━━━


┌────────────────────────────────────────────────────────────────────────────────────────────────────────────────────────┐
┊                                                Mon Mar 20 01:06:17 2023                                                ┊
┊                rank ▻ 38                                                                                               ┊
┊                node ▻ gadi-cpu-clx-1640.gadi.nci.org.au                                                                ┊
┊                year ▻ 2017                                                                                             ┊
┊              in_dir ▻ /g/data/rt52/era5/single-levels/reanalysis/10v/2017/*                                            ┊
┊            out_file ▻ /g/data/wb00/admin/testing/nci_5.625/10m_v_component_of_wind/10m_v_component_of_wind_2017_5.625.nc┊
└────────────────────────────────────────────────────────────────────────────────────────────────────────────────────────┘
<xarray.Dataset>
Dimensions:    (longitude: 1440, latitude: 721, time: 8760)
Coordinates:
  * longitude  (longitude) float32 -180.0 -179.8 -179.5 ... 179.2 179.5 179.8
  * latitude   (latitude) float32 90.0 89.75 89.5 89.25 ... -89.5 -89.75 -90.0
  * time       (time) datetime64[ns] 2017-01-01 ... 2017-12-31T23:00:00
Data variables:
    v10        (time, latitude, longitude) float32 dask.array<chunksize=(4, 721, 1440), meta=np.ndarray>
Attributes:
    Conventions:  CF-1.6
    history:      2020-09-27 03:50:00 UTC+1000 by era5_replication_tools-1.2....
    license:      Licence to use Copernicus Products: https://apps.ecmwf.int/...
    summary:      ERA5 is the fifth generation ECMWF atmospheric reanalysis o...
    title:        ERA5 single-levels reanalysis 10m_v_component_of_wind 20170...
━━━━━━━━━━━━━━━━━━━━━━━━━━━━━━━━━━━━━━━━━━━━━━━━━━━━━━━━━━━━━━━━━━━━━━━━━━━━━━━━━━━━━━━━━━━━━━━━━━━━━━━━━━━━━━━━━━━━━━━━━━


┌────────────────────────────────────────────────────────────────────────────────────────────────────────────────────────┐
┊                                                Mon Mar 20 01:06:19 2023                                                ┊
┊                rank ▻ 39                                                                                               ┊
┊                node ▻ gadi-cpu-clx-1640.gadi.nci.org.au                                                                ┊
┊                year ▻ 2018                                                                                             ┊
┊              in_dir ▻ /g/data/rt52/era5/single-levels/reanalysis/10v/2018/*                                            ┊
┊            out_file ▻ /g/data/wb00/admin/testing/nci_5.625/10m_v_component_of_wind/10m_v_component_of_wind_2018_5.625.nc┊
└────────────────────────────────────────────────────────────────────────────────────────────────────────────────────────┘
<xarray.Dataset>
Dimensions:    (longitude: 1440, latitude: 721, time: 8760)
Coordinates:
  * longitude  (longitude) float32 -180.0 -179.8 -179.5 ... 179.2 179.5 179.8
  * latitude   (latitude) float32 90.0 89.75 89.5 89.25 ... -89.5 -89.75 -90.0
  * time       (time) datetime64[ns] 2018-01-01 ... 2018-12-31T23:00:00
Data variables:
    v10        (time, latitude, longitude) float32 dask.array<chunksize=(4, 721, 1440), meta=np.ndarray>
Attributes:
    Conventions:  CF-1.6
    history:      2020-09-26 23:33:17 UTC+1000 by era5_replication_tools-1.2....
    license:      Licence to use Copernicus Products: https://apps.ecmwf.int/...
    summary:      ERA5 is the fifth generation ECMWF atmospheric reanalysis o...
    title:        ERA5 single-levels reanalysis 10m_v_component_of_wind 20180...
━━━━━━━━━━━━━━━━━━━━━━━━━━━━━━━━━━━━━━━━━━━━━━━━━━━━━━━━━━━━━━━━━━━━━━━━━━━━━━━━━━━━━━━━━━━━━━━━━━━━━━━━━━━━━━━━━━━━━━━━━━


[Mon 20 01:27:46]  End rank: 10,     Out file: /g/data/wb00/admin/testing/nci_5.625/10m_v_component_of_wind/10m_v_component_of_wind_1989_5.625.nc

[Mon 20 01:28:07]  End rank: 8,      Out file: /g/data/wb00/admin/testing/nci_5.625/10m_v_component_of_wind/10m_v_component_of_wind_1987_5.625.nc

[Mon 20 01:28:13]  End rank: 18,     Out file: /g/data/wb00/admin/testing/nci_5.625/10m_v_component_of_wind/10m_v_component_of_wind_1997_5.625.nc

[Mon 20 01:28:17]  End rank: 9,      Out file: /g/data/wb00/admin/testing/nci_5.625/10m_v_component_of_wind/10m_v_component_of_wind_1988_5.625.nc

[Mon 20 01:28:20]  End rank: 11,     Out file: /g/data/wb00/admin/testing/nci_5.625/10m_v_component_of_wind/10m_v_component_of_wind_1990_5.625.nc

[Mon 20 01:28:24]  End rank: 6,      Out file: /g/data/wb00/admin/testing/nci_5.625/10m_v_component_of_wind/10m_v_component_of_wind_1985_5.625.nc

[Mon 20 01:28:27]  End rank: 0,      Out file: /g/data/wb00/admin/testing/nci_5.625/10m_v_component_of_wind/10m_v_component_of_wind_1979_5.625.nc

[Mon 20 01:28:28]  End rank: 7,      Out file: /g/data/wb00/admin/testing/nci_5.625/10m_v_component_of_wind/10m_v_component_of_wind_1986_5.625.nc

[Mon 20 01:28:32]  End rank: 20,     Out file: /g/data/wb00/admin/testing/nci_5.625/10m_v_component_of_wind/10m_v_component_of_wind_1999_5.625.nc

[Mon 20 01:28:37]  End rank: 4,      Out file: /g/data/wb00/admin/testing/nci_5.625/10m_v_component_of_wind/10m_v_component_of_wind_1983_5.625.nc

[Mon 20 01:28:38]  End rank: 5,      Out file: /g/data/wb00/admin/testing/nci_5.625/10m_v_component_of_wind/10m_v_component_of_wind_1984_5.625.nc

[Mon 20 01:28:40]  End rank: 1,      Out file: /g/data/wb00/admin/testing/nci_5.625/10m_v_component_of_wind/10m_v_component_of_wind_1980_5.625.nc

[Mon 20 01:28:41]  End rank: 22,     Out file: /g/data/wb00/admin/testing/nci_5.625/10m_v_component_of_wind/10m_v_component_of_wind_2001_5.625.nc

[Mon 20 01:28:41]  End rank: 16,     Out file: /g/data/wb00/admin/testing/nci_5.625/10m_v_component_of_wind/10m_v_component_of_wind_1995_5.625.nc

[Mon 20 01:28:44]  End rank: 12,     Out file: /g/data/wb00/admin/testing/nci_5.625/10m_v_component_of_wind/10m_v_component_of_wind_1991_5.625.nc

[Mon 20 01:28:50]  End rank: 21,     Out file: /g/data/wb00/admin/testing/nci_5.625/10m_v_component_of_wind/10m_v_component_of_wind_2000_5.625.nc

[Mon 20 01:28:59]  End rank: 24,     Out file: /g/data/wb00/admin/testing/nci_5.625/10m_v_component_of_wind/10m_v_component_of_wind_2003_5.625.nc

[Mon 20 01:29:01]  End rank: 14,     Out file: /g/data/wb00/admin/testing/nci_5.625/10m_v_component_of_wind/10m_v_component_of_wind_1993_5.625.nc

[Mon 20 01:29:01]  End rank: 30,     Out file: /g/data/wb00/admin/testing/nci_5.625/10m_v_component_of_wind/10m_v_component_of_wind_2009_5.625.nc

[Mon 20 01:29:02]  End rank: 28,     Out file: /g/data/wb00/admin/testing/nci_5.625/10m_v_component_of_wind/10m_v_component_of_wind_2007_5.625.nc

[Mon 20 01:29:07]  End rank: 26,     Out file: /g/data/wb00/admin/testing/nci_5.625/10m_v_component_of_wind/10m_v_component_of_wind_2005_5.625.nc

[Mon 20 01:29:08]  End rank: 23,     Out file: /g/data/wb00/admin/testing/nci_5.625/10m_v_component_of_wind/10m_v_component_of_wind_2002_5.625.nc

[Mon 20 01:29:12]  End rank: 36,     Out file: /g/data/wb00/admin/testing/nci_5.625/10m_v_component_of_wind/10m_v_component_of_wind_2015_5.625.nc

[Mon 20 01:29:17]  End rank: 13,     Out file: /g/data/wb00/admin/testing/nci_5.625/10m_v_component_of_wind/10m_v_component_of_wind_1992_5.625.nc

[Mon 20 01:29:20]  End rank: 32,     Out file: /g/data/wb00/admin/testing/nci_5.625/10m_v_component_of_wind/10m_v_component_of_wind_2011_5.625.nc

[Mon 20 01:29:21]  End rank: 19,     Out file: /g/data/wb00/admin/testing/nci_5.625/10m_v_component_of_wind/10m_v_component_of_wind_1998_5.625.nc

[Mon 20 01:29:22]  End rank: 29,     Out file: /g/data/wb00/admin/testing/nci_5.625/10m_v_component_of_wind/10m_v_component_of_wind_2008_5.625.nc

[Mon 20 01:29:24]  End rank: 31,     Out file: /g/data/wb00/admin/testing/nci_5.625/10m_v_component_of_wind/10m_v_component_of_wind_2010_5.625.nc

[Mon 20 01:29:36]  End rank: 34,     Out file: /g/data/wb00/admin/testing/nci_5.625/10m_v_component_of_wind/10m_v_component_of_wind_2013_5.625.nc

[Mon 20 01:29:44]  End rank: 15,     Out file: /g/data/wb00/admin/testing/nci_5.625/10m_v_component_of_wind/10m_v_component_of_wind_1994_5.625.nc

[Mon 20 01:29:47]  End rank: 35,     Out file: /g/data/wb00/admin/testing/nci_5.625/10m_v_component_of_wind/10m_v_component_of_wind_2014_5.625.nc

[Mon 20 01:29:55]  End rank: 39,     Out file: /g/data/wb00/admin/testing/nci_5.625/10m_v_component_of_wind/10m_v_component_of_wind_2018_5.625.nc

[Mon 20 01:29:56]  End rank: 33,     Out file: /g/data/wb00/admin/testing/nci_5.625/10m_v_component_of_wind/10m_v_component_of_wind_2012_5.625.nc

[Mon 20 01:30:36]  End rank: 38,     Out file: /g/data/wb00/admin/testing/nci_5.625/10m_v_component_of_wind/10m_v_component_of_wind_2017_5.625.nc

[Mon 20 01:32:00]  End rank: 27,     Out file: /g/data/wb00/admin/testing/nci_5.625/10m_v_component_of_wind/10m_v_component_of_wind_2006_5.625.nc

[Mon 20 01:32:11]  End rank: 2,      Out file: /g/data/wb00/admin/testing/nci_5.625/10m_v_component_of_wind/10m_v_component_of_wind_1981_5.625.nc

[Mon 20 01:34:36]  End rank: 3,      Out file: /g/data/wb00/admin/testing/nci_5.625/10m_v_component_of_wind/10m_v_component_of_wind_1982_5.625.nc

[Mon 20 01:35:11]  End rank: 25,     Out file: /g/data/wb00/admin/testing/nci_5.625/10m_v_component_of_wind/10m_v_component_of_wind_2004_5.625.nc

[Mon 20 01:37:33]  End rank: 17,     Out file: /g/data/wb00/admin/testing/nci_5.625/10m_v_component_of_wind/10m_v_component_of_wind_1996_5.625.nc

[Mon 20 01:44:02]  End rank: 37,     Out file: /g/data/wb00/admin/testing/nci_5.625/10m_v_component_of_wind/10m_v_component_of_wind_2016_5.625.nc


======================================================================================
                  Resource Usage on 2023-03-20 01:44:22:
   Job Id:             77340346.gadi-pbs
   Project:            fp0
   Exit Status:        0
   Service Units:      635.47
   NCPUs Requested:    480                    NCPUs Used: 480             
                                           CPU Time Used: 15:37:52        
   Memory Requested:   1.86TB                Memory Used: 593.48GB        
   Walltime requested: 02:00:00            Walltime Used: 00:39:43        
   JobFS requested:    200.0GB                JobFS used: 164.04KB        
======================================================================================
