1986
1986
/g/data/wb00/admin/testing/cds_era5/single-levels/reanalysis/tisr/1986
/g/data/wb00/admin/testing/cds_era5/single-levels/reanalysis/tisr/1986/tisr_era5_oper_sfc_19860101-19860131.nc
/g/data/wb00/admin/testing/cds_era5/single-levels/reanalysis/tisr/1986/tisr_era5_oper_sfc_19860201-19860228.nc
/g/data/wb00/admin/testing/cds_era5/single-levels/reanalysis/tisr/1986/tisr_era5_oper_sfc_19860301-19860331.nc
/g/data/wb00/admin/testing/cds_era5/single-levels/reanalysis/tisr/1986/tisr_era5_oper_sfc_19860401-19860430.nc
/g/data/wb00/admin/testing/cds_era5/single-levels/reanalysis/tisr/1986/tisr_era5_oper_sfc_19860501-19860531.nc
/g/data/wb00/admin/testing/cds_era5/single-levels/reanalysis/tisr/1986/tisr_era5_oper_sfc_19860601-19860630.nc
/g/data/wb00/admin/testing/cds_era5/single-levels/reanalysis/tisr/1986/tisr_era5_oper_sfc_19860701-19860731.nc
/g/data/wb00/admin/testing/cds_era5/single-levels/reanalysis/tisr/1986/tisr_era5_oper_sfc_19860801-19860831.nc
/g/data/wb00/admin/testing/cds_era5/single-levels/reanalysis/tisr/1986/tisr_era5_oper_sfc_19860901-19860930.nc
/g/data/wb00/admin/testing/cds_era5/single-levels/reanalysis/tisr/1986/tisr_era5_oper_sfc_19861001-19861031.nc
/g/data/wb00/admin/testing/cds_era5/single-levels/reanalysis/tisr/1986/tisr_era5_oper_sfc_19861101-19861130.nc
/g/data/wb00/admin/testing/cds_era5/single-levels/reanalysis/tisr/1986/tisr_era5_oper_sfc_19861201-19861231.nc

======================================================================================
                  Resource Usage on 2023-05-19 06:37:55:
   Job Id:             84184753.gadi-pbs
   Project:            fp0
   Exit Status:        0
   Service Units:      29.03
   NCPUs Requested:    1                      NCPUs Used: 1               
                                           CPU Time Used: 00:04:43        
   Memory Requested:   10.0GB                Memory Used: 5.43GB          
   Walltime requested: 10:00:00            Walltime Used: 05:48:22        
   JobFS requested:    10.0GB                 JobFS used: 0B              
======================================================================================
