
======================   ALLOCATED NODES   ======================
	gadi-mmem-clx-0002: flags=0x11 slots=48 max_slots=0 slots_inuse=0 state=UP
=================================================================
rank: 0     host: gadi-mmem-clx-0002.gadi.nci.org.au
rank: 1     host: gadi-mmem-clx-0002.gadi.nci.org.au
rank: 2     host: gadi-mmem-clx-0002.gadi.nci.org.au
rank: 3     host: gadi-mmem-clx-0002.gadi.nci.org.au
rank: 4     host: gadi-mmem-clx-0002.gadi.nci.org.au
rank: 5     host: gadi-mmem-clx-0002.gadi.nci.org.au
rank: 6     host: gadi-mmem-clx-0002.gadi.nci.org.au
rank: 7     host: gadi-mmem-clx-0002.gadi.nci.org.au
rank: 8     host: gadi-mmem-clx-0002.gadi.nci.org.au
rank: 9     host: gadi-mmem-clx-0002.gadi.nci.org.au
rank: 10    host: gadi-mmem-clx-0002.gadi.nci.org.au
rank: 11    host: gadi-mmem-clx-0002.gadi.nci.org.au
rank: 12    host: gadi-mmem-clx-0002.gadi.nci.org.au
rank: 13    host: gadi-mmem-clx-0002.gadi.nci.org.au
rank: 14    host: gadi-mmem-clx-0002.gadi.nci.org.au
rank: 15    host: gadi-mmem-clx-0002.gadi.nci.org.au
rank: 16    host: gadi-mmem-clx-0002.gadi.nci.org.au
rank: 17    host: gadi-mmem-clx-0002.gadi.nci.org.au
rank: 18    host: gadi-mmem-clx-0002.gadi.nci.org.au
rank: 19    host: gadi-mmem-clx-0002.gadi.nci.org.au
rank: 20    host: gadi-mmem-clx-0002.gadi.nci.org.au
rank: 21    host: gadi-mmem-clx-0002.gadi.nci.org.au
rank: 22    host: gadi-mmem-clx-0002.gadi.nci.org.au
rank: 23    host: gadi-mmem-clx-0002.gadi.nci.org.au
rank: 24    host: gadi-mmem-clx-0002.gadi.nci.org.au
rank: 25    host: gadi-mmem-clx-0002.gadi.nci.org.au
rank: 26    host: gadi-mmem-clx-0002.gadi.nci.org.au
rank: 27    host: gadi-mmem-clx-0002.gadi.nci.org.au
rank: 28    host: gadi-mmem-clx-0002.gadi.nci.org.au
rank: 29    host: gadi-mmem-clx-0002.gadi.nci.org.au
rank: 30    host: gadi-mmem-clx-0002.gadi.nci.org.au
rank: 31    host: gadi-mmem-clx-0002.gadi.nci.org.au
rank: 32    host: gadi-mmem-clx-0002.gadi.nci.org.au
rank: 33    host: gadi-mmem-clx-0002.gadi.nci.org.au
rank: 34    host: gadi-mmem-clx-0002.gadi.nci.org.au
rank: 35    host: gadi-mmem-clx-0002.gadi.nci.org.au
rank: 36    host: gadi-mmem-clx-0002.gadi.nci.org.au
rank: 37    host: gadi-mmem-clx-0002.gadi.nci.org.au
rank: 38    host: gadi-mmem-clx-0002.gadi.nci.org.au
rank: 39    host: gadi-mmem-clx-0002.gadi.nci.org.au
╔════════════════════════════════════════════════════════════════════════════════════════════════════════════════════════╗
║ ╔════════════════════════════════════════════════════════════════════════════════════════════════════════════════════╗ ║
║ ║                                                    Common Param                                                    ║ ║
║ ║           ERA_param ▶ t                                                                                            ║ ║
║ ║    config_file_path ▶ /scratch/fp0/mah900/WeatherBench/pbs_scripts/config_test.yaml                                ║ ║
║ ║             out_deg ▶ 5.625000                                                                                     ║ ║
║ ║           algorithm ▶ bilinear                                                                                     ║ ║
║ ║      pressure_level ▶ [50, 100, 150, 200, 250, 300, 400, 500, 600, 700, 850, 925, 1000]                            ║ ║
║ ║       in_dir_prefix ▶ /g/data/rt52/era5/pressure-levels/reanalysis/t                                               ║ ║
║ ║     out_file_prefix ▶ /g/data/wb00/admin/testing/nci_5.625/test_test/temperature                                   ║ ║
║ ╚════════════════════════════════════════════════════════════════════════════════════════════════════════════════════╝ ║
╚════════════════════════════════════════════════════════════════════════════════════════════════════════════════════════╝


┌────────────────────────────────────────────────────────────────────────────────────────────────────────────────────────┐
┊                                                Mon Mar 27 19:22:00 2023                                                ┊
┊                rank ▻ 0                                                                                                ┊
┊                node ▻ gadi-mmem-clx-0002.gadi.nci.org.au                                                               ┊
┊                year ▻ 1979                                                                                             ┊
┊              in_dir ▻ /g/data/rt52/era5/pressure-levels/reanalysis/t/1979/*                                            ┊
┊            out_file ▻ /g/data/wb00/admin/testing/nci_5.625/test_test/temperature_1979_5.625.nc                         ┊
└────────────────────────────────────────────────────────────────────────────────────────────────────────────────────────┘
<xarray.Dataset>
Dimensions:    (longitude: 1440, latitude: 721, level: 37, time: 8760)
Coordinates:
  * longitude  (longitude) float32 -180.0 -179.8 -179.5 ... 179.2 179.5 179.8
  * latitude   (latitude) float32 90.0 89.75 89.5 89.25 ... -89.5 -89.75 -90.0
  * level      (level) int32 1 2 3 5 7 10 20 30 ... 850 875 900 925 950 975 1000
  * time       (time) datetime64[ns] 1979-01-01 ... 1979-12-31T23:00:00
Data variables:
    t          (time, level, latitude, longitude) float32 dask.array<chunksize=(4, 37, 721, 1440), meta=np.ndarray>
Attributes:
    Conventions:  CF-1.6
    license:      Licence to use Copernicus Products: https://apps.ecmwf.int/...
    summary:      ERA5 is the fifth generation ECMWF atmospheric reanalysis o...
    title:        ERA5 pressure-levels oper temperature 19790101-19790131
    history:      2021-01-08 07:36:24 UTC+1100 by era5_replication_tools-1.8....
━━━━━━━━━━━━━━━━━━━━━━━━━━━━━━━━━━━━━━━━━━━━━━━━━━━━━━━━━━━━━━━━━━━━━━━━━━━━━━━━━━━━━━━━━━━━━━━━━━━━━━━━━━━━━━━━━━━━━━━━━━


┌────────────────────────────────────────────────────────────────────────────────────────────────────────────────────────┐
┊                                                Mon Mar 27 19:22:05 2023                                                ┊
┊                rank ▻ 1                                                                                                ┊
┊                node ▻ gadi-mmem-clx-0002.gadi.nci.org.au                                                               ┊
┊                year ▻ 1980                                                                                             ┊
┊              in_dir ▻ /g/data/rt52/era5/pressure-levels/reanalysis/t/1980/*                                            ┊
┊            out_file ▻ /g/data/wb00/admin/testing/nci_5.625/test_test/temperature_1980_5.625.nc                         ┊
└────────────────────────────────────────────────────────────────────────────────────────────────────────────────────────┘
<xarray.Dataset>
Dimensions:    (longitude: 1440, latitude: 721, level: 37, time: 8784)
Coordinates:
  * longitude  (longitude) float32 -180.0 -179.8 -179.5 ... 179.2 179.5 179.8
  * latitude   (latitude) float32 90.0 89.75 89.5 89.25 ... -89.5 -89.75 -90.0
  * level      (level) int32 1 2 3 5 7 10 20 30 ... 850 875 900 925 950 975 1000
  * time       (time) datetime64[ns] 1980-01-01 ... 1980-12-31T23:00:00
Data variables:
    t          (time, level, latitude, longitude) float32 dask.array<chunksize=(4, 37, 721, 1440), meta=np.ndarray>
Attributes:
    Conventions:  CF-1.6
    history:      2020-11-06 15:50:54 UTC+1100 by era5_replication_tools-1.2....
    license:      Licence to use Copernicus Products: https://apps.ecmwf.int/...
    summary:      ERA5 is the fifth generation ECMWF atmospheric reanalysis o...
    title:        ERA5 pressure-levels oper temperature 19800101-19800131
━━━━━━━━━━━━━━━━━━━━━━━━━━━━━━━━━━━━━━━━━━━━━━━━━━━━━━━━━━━━━━━━━━━━━━━━━━━━━━━━━━━━━━━━━━━━━━━━━━━━━━━━━━━━━━━━━━━━━━━━━━


┌────────────────────────────────────────────────────────────────────────────────────────────────────────────────────────┐
┊                                                Mon Mar 27 19:22:07 2023                                                ┊
┊                rank ▻ 2                                                                                                ┊
┊                node ▻ gadi-mmem-clx-0002.gadi.nci.org.au                                                               ┊
┊                year ▻ 1981                                                                                             ┊
┊              in_dir ▻ /g/data/rt52/era5/pressure-levels/reanalysis/t/1981/*                                            ┊
┊            out_file ▻ /g/data/wb00/admin/testing/nci_5.625/test_test/temperature_1981_5.625.nc                         ┊
└────────────────────────────────────────────────────────────────────────────────────────────────────────────────────────┘
<xarray.Dataset>
Dimensions:    (longitude: 1440, latitude: 721, level: 37, time: 8760)
Coordinates:
  * longitude  (longitude) float32 -180.0 -179.8 -179.5 ... 179.2 179.5 179.8
  * latitude   (latitude) float32 90.0 89.75 89.5 89.25 ... -89.5 -89.75 -90.0
  * level      (level) int32 1 2 3 5 7 10 20 30 ... 850 875 900 925 950 975 1000
  * time       (time) datetime64[ns] 1981-01-01 ... 1981-12-31T23:00:00
Data variables:
    t          (time, level, latitude, longitude) float32 dask.array<chunksize=(4, 37, 721, 1440), meta=np.ndarray>
Attributes:
    Conventions:  CF-1.6
    history:      2020-11-05 21:33:12 UTC+1100 by era5_replication_tools-1.2....
    license:      Licence to use Copernicus Products: https://apps.ecmwf.int/...
    summary:      ERA5 is the fifth generation ECMWF atmospheric reanalysis o...
    title:        ERA5 pressure-levels oper temperature 19810101-19810131
━━━━━━━━━━━━━━━━━━━━━━━━━━━━━━━━━━━━━━━━━━━━━━━━━━━━━━━━━━━━━━━━━━━━━━━━━━━━━━━━━━━━━━━━━━━━━━━━━━━━━━━━━━━━━━━━━━━━━━━━━━


┌────────────────────────────────────────────────────────────────────────────────────────────────────────────────────────┐
┊                                                Mon Mar 27 19:22:09 2023                                                ┊
┊                rank ▻ 3                                                                                                ┊
┊                node ▻ gadi-mmem-clx-0002.gadi.nci.org.au                                                               ┊
┊                year ▻ 1982                                                                                             ┊
┊              in_dir ▻ /g/data/rt52/era5/pressure-levels/reanalysis/t/1982/*                                            ┊
┊            out_file ▻ /g/data/wb00/admin/testing/nci_5.625/test_test/temperature_1982_5.625.nc                         ┊
└────────────────────────────────────────────────────────────────────────────────────────────────────────────────────────┘
<xarray.Dataset>
Dimensions:    (longitude: 1440, latitude: 721, level: 37, time: 8760)
Coordinates:
  * longitude  (longitude) float32 -180.0 -179.8 -179.5 ... 179.2 179.5 179.8
  * latitude   (latitude) float32 90.0 89.75 89.5 89.25 ... -89.5 -89.75 -90.0
  * level      (level) int32 1 2 3 5 7 10 20 30 ... 850 875 900 925 950 975 1000
  * time       (time) datetime64[ns] 1982-01-01 ... 1982-12-31T23:00:00
Data variables:
    t          (time, level, latitude, longitude) float32 dask.array<chunksize=(4, 37, 721, 1440), meta=np.ndarray>
Attributes:
    Conventions:  CF-1.6
    history:      2020-11-04 23:37:17 UTC+1100 by era5_replication_tools-1.2....
    license:      Licence to use Copernicus Products: https://apps.ecmwf.int/...
    summary:      ERA5 is the fifth generation ECMWF atmospheric reanalysis o...
    title:        ERA5 pressure-levels oper temperature 19820101-19820131
━━━━━━━━━━━━━━━━━━━━━━━━━━━━━━━━━━━━━━━━━━━━━━━━━━━━━━━━━━━━━━━━━━━━━━━━━━━━━━━━━━━━━━━━━━━━━━━━━━━━━━━━━━━━━━━━━━━━━━━━━━


┌────────────────────────────────────────────────────────────────────────────────────────────────────────────────────────┐
┊                                                Mon Mar 27 19:22:11 2023                                                ┊
┊                rank ▻ 4                                                                                                ┊
┊                node ▻ gadi-mmem-clx-0002.gadi.nci.org.au                                                               ┊
┊                year ▻ 1983                                                                                             ┊
┊              in_dir ▻ /g/data/rt52/era5/pressure-levels/reanalysis/t/1983/*                                            ┊
┊            out_file ▻ /g/data/wb00/admin/testing/nci_5.625/test_test/temperature_1983_5.625.nc                         ┊
└────────────────────────────────────────────────────────────────────────────────────────────────────────────────────────┘
<xarray.Dataset>
Dimensions:    (longitude: 1440, latitude: 721, level: 37, time: 8760)
Coordinates:
  * longitude  (longitude) float32 -180.0 -179.8 -179.5 ... 179.2 179.5 179.8
  * latitude   (latitude) float32 90.0 89.75 89.5 89.25 ... -89.5 -89.75 -90.0
  * level      (level) int32 1 2 3 5 7 10 20 30 ... 850 875 900 925 950 975 1000
  * time       (time) datetime64[ns] 1983-01-01 ... 1983-12-31T23:00:00
Data variables:
    t          (time, level, latitude, longitude) float32 dask.array<chunksize=(4, 37, 721, 1440), meta=np.ndarray>
Attributes:
    Conventions:  CF-1.6
    history:      2020-11-04 08:37:37 UTC+1100 by era5_replication_tools-1.2....
    license:      Licence to use Copernicus Products: https://apps.ecmwf.int/...
    summary:      ERA5 is the fifth generation ECMWF atmospheric reanalysis o...
    title:        ERA5 pressure-levels oper temperature 19830101-19830131
━━━━━━━━━━━━━━━━━━━━━━━━━━━━━━━━━━━━━━━━━━━━━━━━━━━━━━━━━━━━━━━━━━━━━━━━━━━━━━━━━━━━━━━━━━━━━━━━━━━━━━━━━━━━━━━━━━━━━━━━━━


┌────────────────────────────────────────────────────────────────────────────────────────────────────────────────────────┐
┊                                                Mon Mar 27 19:22:13 2023                                                ┊
┊                rank ▻ 5                                                                                                ┊
┊                node ▻ gadi-mmem-clx-0002.gadi.nci.org.au                                                               ┊
┊                year ▻ 1984                                                                                             ┊
┊              in_dir ▻ /g/data/rt52/era5/pressure-levels/reanalysis/t/1984/*                                            ┊
┊            out_file ▻ /g/data/wb00/admin/testing/nci_5.625/test_test/temperature_1984_5.625.nc                         ┊
└────────────────────────────────────────────────────────────────────────────────────────────────────────────────────────┘
<xarray.Dataset>
Dimensions:    (longitude: 1440, latitude: 721, level: 37, time: 8784)
Coordinates:
  * longitude  (longitude) float32 -180.0 -179.8 -179.5 ... 179.2 179.5 179.8
  * latitude   (latitude) float32 90.0 89.75 89.5 89.25 ... -89.5 -89.75 -90.0
  * level      (level) int32 1 2 3 5 7 10 20 30 ... 850 875 900 925 950 975 1000
  * time       (time) datetime64[ns] 1984-01-01 ... 1984-12-31T23:00:00
Data variables:
    t          (time, level, latitude, longitude) float32 dask.array<chunksize=(4, 37, 721, 1440), meta=np.ndarray>
Attributes:
    Conventions:  CF-1.6
    history:      2020-11-03 14:14:22 UTC+1100 by era5_replication_tools-1.2....
    license:      Licence to use Copernicus Products: https://apps.ecmwf.int/...
    summary:      ERA5 is the fifth generation ECMWF atmospheric reanalysis o...
    title:        ERA5 pressure-levels oper temperature 19840101-19840131
━━━━━━━━━━━━━━━━━━━━━━━━━━━━━━━━━━━━━━━━━━━━━━━━━━━━━━━━━━━━━━━━━━━━━━━━━━━━━━━━━━━━━━━━━━━━━━━━━━━━━━━━━━━━━━━━━━━━━━━━━━


┌────────────────────────────────────────────────────────────────────────────────────────────────────────────────────────┐
┊                                                Mon Mar 27 19:22:15 2023                                                ┊
┊                rank ▻ 6                                                                                                ┊
┊                node ▻ gadi-mmem-clx-0002.gadi.nci.org.au                                                               ┊
┊                year ▻ 1985                                                                                             ┊
┊              in_dir ▻ /g/data/rt52/era5/pressure-levels/reanalysis/t/1985/*                                            ┊
┊            out_file ▻ /g/data/wb00/admin/testing/nci_5.625/test_test/temperature_1985_5.625.nc                         ┊
└────────────────────────────────────────────────────────────────────────────────────────────────────────────────────────┘
<xarray.Dataset>
Dimensions:    (longitude: 1440, latitude: 721, level: 37, time: 8760)
Coordinates:
  * longitude  (longitude) float32 -180.0 -179.8 -179.5 ... 179.2 179.5 179.8
  * latitude   (latitude) float32 90.0 89.75 89.5 89.25 ... -89.5 -89.75 -90.0
  * level      (level) int32 1 2 3 5 7 10 20 30 ... 850 875 900 925 950 975 1000
  * time       (time) datetime64[ns] 1985-01-01 ... 1985-12-31T23:00:00
Data variables:
    t          (time, level, latitude, longitude) float32 dask.array<chunksize=(4, 37, 721, 1440), meta=np.ndarray>
Attributes:
    Conventions:  CF-1.6
    history:      2020-11-02 20:05:29 UTC+1100 by era5_replication_tools-1.2....
    license:      Licence to use Copernicus Products: https://apps.ecmwf.int/...
    summary:      ERA5 is the fifth generation ECMWF atmospheric reanalysis o...
    title:        ERA5 pressure-levels oper temperature 19850101-19850131
━━━━━━━━━━━━━━━━━━━━━━━━━━━━━━━━━━━━━━━━━━━━━━━━━━━━━━━━━━━━━━━━━━━━━━━━━━━━━━━━━━━━━━━━━━━━━━━━━━━━━━━━━━━━━━━━━━━━━━━━━━


┌────────────────────────────────────────────────────────────────────────────────────────────────────────────────────────┐
┊                                                Mon Mar 27 19:22:17 2023                                                ┊
┊                rank ▻ 7                                                                                                ┊
┊                node ▻ gadi-mmem-clx-0002.gadi.nci.org.au                                                               ┊
┊                year ▻ 1986                                                                                             ┊
┊              in_dir ▻ /g/data/rt52/era5/pressure-levels/reanalysis/t/1986/*                                            ┊
┊            out_file ▻ /g/data/wb00/admin/testing/nci_5.625/test_test/temperature_1986_5.625.nc                         ┊
└────────────────────────────────────────────────────────────────────────────────────────────────────────────────────────┘
<xarray.Dataset>
Dimensions:    (longitude: 1440, latitude: 721, level: 37, time: 8760)
Coordinates:
  * longitude  (longitude) float32 -180.0 -179.8 -179.5 ... 179.2 179.5 179.8
  * latitude   (latitude) float32 90.0 89.75 89.5 89.25 ... -89.5 -89.75 -90.0
  * level      (level) int32 1 2 3 5 7 10 20 30 ... 850 875 900 925 950 975 1000
  * time       (time) datetime64[ns] 1986-01-01 ... 1986-12-31T23:00:00
Data variables:
    t          (time, level, latitude, longitude) float32 dask.array<chunksize=(4, 37, 721, 1440), meta=np.ndarray>
Attributes:
    Conventions:  CF-1.6
    history:      2020-11-02 04:20:05 UTC+1100 by era5_replication_tools-1.2....
    license:      Licence to use Copernicus Products: https://apps.ecmwf.int/...
    summary:      ERA5 is the fifth generation ECMWF atmospheric reanalysis o...
    title:        ERA5 pressure-levels oper temperature 19860101-19860131
━━━━━━━━━━━━━━━━━━━━━━━━━━━━━━━━━━━━━━━━━━━━━━━━━━━━━━━━━━━━━━━━━━━━━━━━━━━━━━━━━━━━━━━━━━━━━━━━━━━━━━━━━━━━━━━━━━━━━━━━━━


┌────────────────────────────────────────────────────────────────────────────────────────────────────────────────────────┐
┊                                                Mon Mar 27 19:22:19 2023                                                ┊
┊                rank ▻ 8                                                                                                ┊
┊                node ▻ gadi-mmem-clx-0002.gadi.nci.org.au                                                               ┊
┊                year ▻ 1987                                                                                             ┊
┊              in_dir ▻ /g/data/rt52/era5/pressure-levels/reanalysis/t/1987/*                                            ┊
┊            out_file ▻ /g/data/wb00/admin/testing/nci_5.625/test_test/temperature_1987_5.625.nc                         ┊
└────────────────────────────────────────────────────────────────────────────────────────────────────────────────────────┘
<xarray.Dataset>
Dimensions:    (longitude: 1440, latitude: 721, level: 37, time: 8760)
Coordinates:
  * longitude  (longitude) float32 -180.0 -179.8 -179.5 ... 179.2 179.5 179.8
  * latitude   (latitude) float32 90.0 89.75 89.5 89.25 ... -89.5 -89.75 -90.0
  * level      (level) int32 1 2 3 5 7 10 20 30 ... 850 875 900 925 950 975 1000
  * time       (time) datetime64[ns] 1987-01-01 ... 1987-12-31T23:00:00
Data variables:
    t          (time, level, latitude, longitude) float32 dask.array<chunksize=(4, 37, 721, 1440), meta=np.ndarray>
Attributes:
    Conventions:  CF-1.6
    history:      2020-11-01 13:33:06 UTC+1100 by era5_replication_tools-1.2....
    license:      Licence to use Copernicus Products: https://apps.ecmwf.int/...
    summary:      ERA5 is the fifth generation ECMWF atmospheric reanalysis o...
    title:        ERA5 pressure-levels oper temperature 19870101-19870131
━━━━━━━━━━━━━━━━━━━━━━━━━━━━━━━━━━━━━━━━━━━━━━━━━━━━━━━━━━━━━━━━━━━━━━━━━━━━━━━━━━━━━━━━━━━━━━━━━━━━━━━━━━━━━━━━━━━━━━━━━━


┌────────────────────────────────────────────────────────────────────────────────────────────────────────────────────────┐
┊                                                Mon Mar 27 19:22:21 2023                                                ┊
┊                rank ▻ 9                                                                                                ┊
┊                node ▻ gadi-mmem-clx-0002.gadi.nci.org.au                                                               ┊
┊                year ▻ 1988                                                                                             ┊
┊              in_dir ▻ /g/data/rt52/era5/pressure-levels/reanalysis/t/1988/*                                            ┊
┊            out_file ▻ /g/data/wb00/admin/testing/nci_5.625/test_test/temperature_1988_5.625.nc                         ┊
└────────────────────────────────────────────────────────────────────────────────────────────────────────────────────────┘
<xarray.Dataset>
Dimensions:    (longitude: 1440, latitude: 721, level: 37, time: 8784)
Coordinates:
  * longitude  (longitude) float32 -180.0 -179.8 -179.5 ... 179.2 179.5 179.8
  * latitude   (latitude) float32 90.0 89.75 89.5 89.25 ... -89.5 -89.75 -90.0
  * level      (level) int32 1 2 3 5 7 10 20 30 ... 850 875 900 925 950 975 1000
  * time       (time) datetime64[ns] 1988-01-01 ... 1988-12-31T23:00:00
Data variables:
    t          (time, level, latitude, longitude) float32 dask.array<chunksize=(4, 37, 721, 1440), meta=np.ndarray>
Attributes:
    Conventions:  CF-1.6
    history:      2020-10-31 20:31:22 UTC+1100 by era5_replication_tools-1.2....
    license:      Licence to use Copernicus Products: https://apps.ecmwf.int/...
    summary:      ERA5 is the fifth generation ECMWF atmospheric reanalysis o...
    title:        ERA5 pressure-levels oper temperature 19880101-19880131
━━━━━━━━━━━━━━━━━━━━━━━━━━━━━━━━━━━━━━━━━━━━━━━━━━━━━━━━━━━━━━━━━━━━━━━━━━━━━━━━━━━━━━━━━━━━━━━━━━━━━━━━━━━━━━━━━━━━━━━━━━


┌────────────────────────────────────────────────────────────────────────────────────────────────────────────────────────┐
┊                                                Mon Mar 27 19:22:23 2023                                                ┊
┊                rank ▻ 10                                                                                               ┊
┊                node ▻ gadi-mmem-clx-0002.gadi.nci.org.au                                                               ┊
┊                year ▻ 1989                                                                                             ┊
┊              in_dir ▻ /g/data/rt52/era5/pressure-levels/reanalysis/t/1989/*                                            ┊
┊            out_file ▻ /g/data/wb00/admin/testing/nci_5.625/test_test/temperature_1989_5.625.nc                         ┊
└────────────────────────────────────────────────────────────────────────────────────────────────────────────────────────┘
<xarray.Dataset>
Dimensions:    (longitude: 1440, latitude: 721, level: 37, time: 8760)
Coordinates:
  * longitude  (longitude) float32 -180.0 -179.8 -179.5 ... 179.2 179.5 179.8
  * latitude   (latitude) float32 90.0 89.75 89.5 89.25 ... -89.5 -89.75 -90.0
  * level      (level) int32 1 2 3 5 7 10 20 30 ... 850 875 900 925 950 975 1000
  * time       (time) datetime64[ns] 1989-01-01 ... 1989-12-31T23:00:00
Data variables:
    t          (time, level, latitude, longitude) float32 dask.array<chunksize=(4, 37, 721, 1440), meta=np.ndarray>
Attributes:
    Conventions:  CF-1.6
    history:      2020-10-31 02:56:40 UTC+1100 by era5_replication_tools-1.2....
    license:      Licence to use Copernicus Products: https://apps.ecmwf.int/...
    summary:      ERA5 is the fifth generation ECMWF atmospheric reanalysis o...
    title:        ERA5 pressure-levels oper temperature 19890101-19890131
━━━━━━━━━━━━━━━━━━━━━━━━━━━━━━━━━━━━━━━━━━━━━━━━━━━━━━━━━━━━━━━━━━━━━━━━━━━━━━━━━━━━━━━━━━━━━━━━━━━━━━━━━━━━━━━━━━━━━━━━━━


┌────────────────────────────────────────────────────────────────────────────────────────────────────────────────────────┐
┊                                                Mon Mar 27 19:22:25 2023                                                ┊
┊                rank ▻ 11                                                                                               ┊
┊                node ▻ gadi-mmem-clx-0002.gadi.nci.org.au                                                               ┊
┊                year ▻ 1990                                                                                             ┊
┊              in_dir ▻ /g/data/rt52/era5/pressure-levels/reanalysis/t/1990/*                                            ┊
┊            out_file ▻ /g/data/wb00/admin/testing/nci_5.625/test_test/temperature_1990_5.625.nc                         ┊
└────────────────────────────────────────────────────────────────────────────────────────────────────────────────────────┘
<xarray.Dataset>
Dimensions:    (longitude: 1440, latitude: 721, level: 37, time: 8760)
Coordinates:
  * longitude  (longitude) float32 -180.0 -179.8 -179.5 ... 179.2 179.5 179.8
  * latitude   (latitude) float32 90.0 89.75 89.5 89.25 ... -89.5 -89.75 -90.0
  * level      (level) int32 1 2 3 5 7 10 20 30 ... 850 875 900 925 950 975 1000
  * time       (time) datetime64[ns] 1990-01-01 ... 1990-12-31T23:00:00
Data variables:
    t          (time, level, latitude, longitude) float32 dask.array<chunksize=(4, 37, 721, 1440), meta=np.ndarray>
Attributes:
    Conventions:  CF-1.6
    history:      2020-10-30 12:10:29 UTC+1100 by era5_replication_tools-1.2....
    license:      Licence to use Copernicus Products: https://apps.ecmwf.int/...
    summary:      ERA5 is the fifth generation ECMWF atmospheric reanalysis o...
    title:        ERA5 pressure-levels oper temperature 19900101-19900131
━━━━━━━━━━━━━━━━━━━━━━━━━━━━━━━━━━━━━━━━━━━━━━━━━━━━━━━━━━━━━━━━━━━━━━━━━━━━━━━━━━━━━━━━━━━━━━━━━━━━━━━━━━━━━━━━━━━━━━━━━━


┌────────────────────────────────────────────────────────────────────────────────────────────────────────────────────────┐
┊                                                Mon Mar 27 19:22:27 2023                                                ┊
┊                rank ▻ 12                                                                                               ┊
┊                node ▻ gadi-mmem-clx-0002.gadi.nci.org.au                                                               ┊
┊                year ▻ 1991                                                                                             ┊
┊              in_dir ▻ /g/data/rt52/era5/pressure-levels/reanalysis/t/1991/*                                            ┊
┊            out_file ▻ /g/data/wb00/admin/testing/nci_5.625/test_test/temperature_1991_5.625.nc                         ┊
└────────────────────────────────────────────────────────────────────────────────────────────────────────────────────────┘
<xarray.Dataset>
Dimensions:    (longitude: 1440, latitude: 721, level: 37, time: 8760)
Coordinates:
  * longitude  (longitude) float32 -180.0 -179.8 -179.5 ... 179.2 179.5 179.8
  * latitude   (latitude) float32 90.0 89.75 89.5 89.25 ... -89.5 -89.75 -90.0
  * level      (level) int32 1 2 3 5 7 10 20 30 ... 850 875 900 925 950 975 1000
  * time       (time) datetime64[ns] 1991-01-01 ... 1991-12-31T23:00:00
Data variables:
    t          (time, level, latitude, longitude) float32 dask.array<chunksize=(4, 37, 721, 1440), meta=np.ndarray>
Attributes:
    Conventions:  CF-1.6
    history:      2020-10-29 20:21:35 UTC+1100 by era5_replication_tools-1.2....
    license:      Licence to use Copernicus Products: https://apps.ecmwf.int/...
    summary:      ERA5 is the fifth generation ECMWF atmospheric reanalysis o...
    title:        ERA5 pressure-levels oper temperature 19910101-19910131
━━━━━━━━━━━━━━━━━━━━━━━━━━━━━━━━━━━━━━━━━━━━━━━━━━━━━━━━━━━━━━━━━━━━━━━━━━━━━━━━━━━━━━━━━━━━━━━━━━━━━━━━━━━━━━━━━━━━━━━━━━


┌────────────────────────────────────────────────────────────────────────────────────────────────────────────────────────┐
┊                                                Mon Mar 27 19:22:29 2023                                                ┊
┊                rank ▻ 13                                                                                               ┊
┊                node ▻ gadi-mmem-clx-0002.gadi.nci.org.au                                                               ┊
┊                year ▻ 1992                                                                                             ┊
┊              in_dir ▻ /g/data/rt52/era5/pressure-levels/reanalysis/t/1992/*                                            ┊
┊            out_file ▻ /g/data/wb00/admin/testing/nci_5.625/test_test/temperature_1992_5.625.nc                         ┊
└────────────────────────────────────────────────────────────────────────────────────────────────────────────────────────┘
<xarray.Dataset>
Dimensions:    (longitude: 1440, latitude: 721, level: 37, time: 8784)
Coordinates:
  * longitude  (longitude) float32 -180.0 -179.8 -179.5 ... 179.2 179.5 179.8
  * latitude   (latitude) float32 90.0 89.75 89.5 89.25 ... -89.5 -89.75 -90.0
  * level      (level) int32 1 2 3 5 7 10 20 30 ... 850 875 900 925 950 975 1000
  * time       (time) datetime64[ns] 1992-01-01 ... 1992-12-31T23:00:00
Data variables:
    t          (time, level, latitude, longitude) float32 dask.array<chunksize=(4, 37, 721, 1440), meta=np.ndarray>
Attributes:
    Conventions:  CF-1.6
    history:      2020-10-29 05:10:26 UTC+1100 by era5_replication_tools-1.2....
    license:      Licence to use Copernicus Products: https://apps.ecmwf.int/...
    summary:      ERA5 is the fifth generation ECMWF atmospheric reanalysis o...
    title:        ERA5 pressure-levels oper temperature 19920101-19920131
━━━━━━━━━━━━━━━━━━━━━━━━━━━━━━━━━━━━━━━━━━━━━━━━━━━━━━━━━━━━━━━━━━━━━━━━━━━━━━━━━━━━━━━━━━━━━━━━━━━━━━━━━━━━━━━━━━━━━━━━━━


┌────────────────────────────────────────────────────────────────────────────────────────────────────────────────────────┐
┊                                                Mon Mar 27 19:22:31 2023                                                ┊
┊                rank ▻ 14                                                                                               ┊
┊                node ▻ gadi-mmem-clx-0002.gadi.nci.org.au                                                               ┊
┊                year ▻ 1993                                                                                             ┊
┊              in_dir ▻ /g/data/rt52/era5/pressure-levels/reanalysis/t/1993/*                                            ┊
┊            out_file ▻ /g/data/wb00/admin/testing/nci_5.625/test_test/temperature_1993_5.625.nc                         ┊
└────────────────────────────────────────────────────────────────────────────────────────────────────────────────────────┘
<xarray.Dataset>
Dimensions:    (longitude: 1440, latitude: 721, level: 37, time: 8760)
Coordinates:
  * longitude  (longitude) float32 -180.0 -179.8 -179.5 ... 179.2 179.5 179.8
  * latitude   (latitude) float32 90.0 89.75 89.5 89.25 ... -89.5 -89.75 -90.0
  * level      (level) int32 1 2 3 5 7 10 20 30 ... 850 875 900 925 950 975 1000
  * time       (time) datetime64[ns] 1993-01-01 ... 1993-12-31T23:00:00
Data variables:
    t          (time, level, latitude, longitude) float32 dask.array<chunksize=(4, 37, 721, 1440), meta=np.ndarray>
Attributes:
    Conventions:  CF-1.6
    history:      2020-10-28 17:11:58 UTC+1100 by era5_replication_tools-1.2....
    license:      Licence to use Copernicus Products: https://apps.ecmwf.int/...
    summary:      ERA5 is the fifth generation ECMWF atmospheric reanalysis o...
    title:        ERA5 pressure-levels oper temperature 19930101-19930131
━━━━━━━━━━━━━━━━━━━━━━━━━━━━━━━━━━━━━━━━━━━━━━━━━━━━━━━━━━━━━━━━━━━━━━━━━━━━━━━━━━━━━━━━━━━━━━━━━━━━━━━━━━━━━━━━━━━━━━━━━━


┌────────────────────────────────────────────────────────────────────────────────────────────────────────────────────────┐
┊                                                Mon Mar 27 19:22:33 2023                                                ┊
┊                rank ▻ 15                                                                                               ┊
┊                node ▻ gadi-mmem-clx-0002.gadi.nci.org.au                                                               ┊
┊                year ▻ 1994                                                                                             ┊
┊              in_dir ▻ /g/data/rt52/era5/pressure-levels/reanalysis/t/1994/*                                            ┊
┊            out_file ▻ /g/data/wb00/admin/testing/nci_5.625/test_test/temperature_1994_5.625.nc                         ┊
└────────────────────────────────────────────────────────────────────────────────────────────────────────────────────────┘
<xarray.Dataset>
Dimensions:    (longitude: 1440, latitude: 721, level: 37, time: 8760)
Coordinates:
  * longitude  (longitude) float32 -180.0 -179.8 -179.5 ... 179.2 179.5 179.8
  * latitude   (latitude) float32 90.0 89.75 89.5 89.25 ... -89.5 -89.75 -90.0
  * level      (level) int32 1 2 3 5 7 10 20 30 ... 850 875 900 925 950 975 1000
  * time       (time) datetime64[ns] 1994-01-01 ... 1994-12-31T23:00:00
Data variables:
    t          (time, level, latitude, longitude) float32 dask.array<chunksize=(4, 37, 721, 1440), meta=np.ndarray>
Attributes:
    Conventions:  CF-1.6
    history:      2020-10-28 01:17:09 UTC+1100 by era5_replication_tools-1.2....
    license:      Licence to use Copernicus Products: https://apps.ecmwf.int/...
    summary:      ERA5 is the fifth generation ECMWF atmospheric reanalysis o...
    title:        ERA5 pressure-levels oper temperature 19940101-19940131
━━━━━━━━━━━━━━━━━━━━━━━━━━━━━━━━━━━━━━━━━━━━━━━━━━━━━━━━━━━━━━━━━━━━━━━━━━━━━━━━━━━━━━━━━━━━━━━━━━━━━━━━━━━━━━━━━━━━━━━━━━


┌────────────────────────────────────────────────────────────────────────────────────────────────────────────────────────┐
┊                                                Mon Mar 27 19:22:35 2023                                                ┊
┊                rank ▻ 16                                                                                               ┊
┊                node ▻ gadi-mmem-clx-0002.gadi.nci.org.au                                                               ┊
┊                year ▻ 1995                                                                                             ┊
┊              in_dir ▻ /g/data/rt52/era5/pressure-levels/reanalysis/t/1995/*                                            ┊
┊            out_file ▻ /g/data/wb00/admin/testing/nci_5.625/test_test/temperature_1995_5.625.nc                         ┊
└────────────────────────────────────────────────────────────────────────────────────────────────────────────────────────┘
<xarray.Dataset>
Dimensions:    (longitude: 1440, latitude: 721, level: 37, time: 8760)
Coordinates:
  * longitude  (longitude) float32 -180.0 -179.8 -179.5 ... 179.2 179.5 179.8
  * latitude   (latitude) float32 90.0 89.75 89.5 89.25 ... -89.5 -89.75 -90.0
  * level      (level) int32 1 2 3 5 7 10 20 30 ... 850 875 900 925 950 975 1000
  * time       (time) datetime64[ns] 1995-01-01 ... 1995-12-31T23:00:00
Data variables:
    t          (time, level, latitude, longitude) float32 dask.array<chunksize=(4, 37, 721, 1440), meta=np.ndarray>
Attributes:
    Conventions:  CF-1.6
    history:      2020-10-27 07:51:22 UTC+1100 by era5_replication_tools-1.2....
    license:      Licence to use Copernicus Products: https://apps.ecmwf.int/...
    summary:      ERA5 is the fifth generation ECMWF atmospheric reanalysis o...
    title:        ERA5 pressure-levels oper temperature 19950101-19950131
━━━━━━━━━━━━━━━━━━━━━━━━━━━━━━━━━━━━━━━━━━━━━━━━━━━━━━━━━━━━━━━━━━━━━━━━━━━━━━━━━━━━━━━━━━━━━━━━━━━━━━━━━━━━━━━━━━━━━━━━━━


┌────────────────────────────────────────────────────────────────────────────────────────────────────────────────────────┐
┊                                                Mon Mar 27 19:22:37 2023                                                ┊
┊                rank ▻ 17                                                                                               ┊
┊                node ▻ gadi-mmem-clx-0002.gadi.nci.org.au                                                               ┊
┊                year ▻ 1996                                                                                             ┊
┊              in_dir ▻ /g/data/rt52/era5/pressure-levels/reanalysis/t/1996/*                                            ┊
┊            out_file ▻ /g/data/wb00/admin/testing/nci_5.625/test_test/temperature_1996_5.625.nc                         ┊
└────────────────────────────────────────────────────────────────────────────────────────────────────────────────────────┘
<xarray.Dataset>
Dimensions:    (longitude: 1440, latitude: 721, level: 37, time: 8784)
Coordinates:
  * longitude  (longitude) float32 -180.0 -179.8 -179.5 ... 179.2 179.5 179.8
  * latitude   (latitude) float32 90.0 89.75 89.5 89.25 ... -89.5 -89.75 -90.0
  * level      (level) int32 1 2 3 5 7 10 20 30 ... 850 875 900 925 950 975 1000
  * time       (time) datetime64[ns] 1996-01-01 ... 1996-12-31T23:00:00
Data variables:
    t          (time, level, latitude, longitude) float32 dask.array<chunksize=(4, 37, 721, 1440), meta=np.ndarray>
Attributes:
    Conventions:  CF-1.6
    history:      2021-08-26 22:59:41 UTC+1000 by era5_replication_tools-1.9....
    license:      Licence to use Copernicus Products: https://apps.ecmwf.int/...
    summary:      ERA5 is the fifth generation ECMWF atmospheric reanalysis o...
    title:        ERA5 pressure-levels oper temperature 19960101-19960131
━━━━━━━━━━━━━━━━━━━━━━━━━━━━━━━━━━━━━━━━━━━━━━━━━━━━━━━━━━━━━━━━━━━━━━━━━━━━━━━━━━━━━━━━━━━━━━━━━━━━━━━━━━━━━━━━━━━━━━━━━━


┌────────────────────────────────────────────────────────────────────────────────────────────────────────────────────────┐
┊                                                Mon Mar 27 19:22:39 2023                                                ┊
┊                rank ▻ 18                                                                                               ┊
┊                node ▻ gadi-mmem-clx-0002.gadi.nci.org.au                                                               ┊
┊                year ▻ 1997                                                                                             ┊
┊              in_dir ▻ /g/data/rt52/era5/pressure-levels/reanalysis/t/1997/*                                            ┊
┊            out_file ▻ /g/data/wb00/admin/testing/nci_5.625/test_test/temperature_1997_5.625.nc                         ┊
└────────────────────────────────────────────────────────────────────────────────────────────────────────────────────────┘
<xarray.Dataset>
Dimensions:    (longitude: 1440, latitude: 721, level: 37, time: 8760)
Coordinates:
  * longitude  (longitude) float32 -180.0 -179.8 -179.5 ... 179.2 179.5 179.8
  * latitude   (latitude) float32 90.0 89.75 89.5 89.25 ... -89.5 -89.75 -90.0
  * level      (level) int32 1 2 3 5 7 10 20 30 ... 850 875 900 925 950 975 1000
  * time       (time) datetime64[ns] 1997-01-01 ... 1997-12-31T23:00:00
Data variables:
    t          (time, level, latitude, longitude) float32 dask.array<chunksize=(4, 37, 721, 1440), meta=np.ndarray>
Attributes:
    Conventions:  CF-1.6
    history:      2020-10-25 01:54:23 UTC+1100 by era5_replication_tools-1.2....
    license:      Licence to use Copernicus Products: https://apps.ecmwf.int/...
    summary:      ERA5 is the fifth generation ECMWF atmospheric reanalysis o...
    title:        ERA5 pressure-levels oper temperature 19970101-19970131
━━━━━━━━━━━━━━━━━━━━━━━━━━━━━━━━━━━━━━━━━━━━━━━━━━━━━━━━━━━━━━━━━━━━━━━━━━━━━━━━━━━━━━━━━━━━━━━━━━━━━━━━━━━━━━━━━━━━━━━━━━


┌────────────────────────────────────────────────────────────────────────────────────────────────────────────────────────┐
┊                                                Mon Mar 27 19:22:41 2023                                                ┊
┊                rank ▻ 19                                                                                               ┊
┊                node ▻ gadi-mmem-clx-0002.gadi.nci.org.au                                                               ┊
┊                year ▻ 1998                                                                                             ┊
┊              in_dir ▻ /g/data/rt52/era5/pressure-levels/reanalysis/t/1998/*                                            ┊
┊            out_file ▻ /g/data/wb00/admin/testing/nci_5.625/test_test/temperature_1998_5.625.nc                         ┊
└────────────────────────────────────────────────────────────────────────────────────────────────────────────────────────┘
<xarray.Dataset>
Dimensions:    (longitude: 1440, latitude: 721, level: 37, time: 8760)
Coordinates:
  * longitude  (longitude) float32 -180.0 -179.8 -179.5 ... 179.2 179.5 179.8
  * latitude   (latitude) float32 90.0 89.75 89.5 89.25 ... -89.5 -89.75 -90.0
  * level      (level) int32 1 2 3 5 7 10 20 30 ... 850 875 900 925 950 975 1000
  * time       (time) datetime64[ns] 1998-01-01 ... 1998-12-31T23:00:00
Data variables:
    t          (time, level, latitude, longitude) float32 dask.array<chunksize=(4, 37, 721, 1440), meta=np.ndarray>
Attributes:
    Conventions:  CF-1.6
    history:      2020-10-24 08:42:38 UTC+1100 by era5_replication_tools-1.2....
    license:      Licence to use Copernicus Products: https://apps.ecmwf.int/...
    summary:      ERA5 is the fifth generation ECMWF atmospheric reanalysis o...
    title:        ERA5 pressure-levels oper temperature 19980101-19980131
━━━━━━━━━━━━━━━━━━━━━━━━━━━━━━━━━━━━━━━━━━━━━━━━━━━━━━━━━━━━━━━━━━━━━━━━━━━━━━━━━━━━━━━━━━━━━━━━━━━━━━━━━━━━━━━━━━━━━━━━━━


┌────────────────────────────────────────────────────────────────────────────────────────────────────────────────────────┐
┊                                                Mon Mar 27 19:22:43 2023                                                ┊
┊                rank ▻ 20                                                                                               ┊
┊                node ▻ gadi-mmem-clx-0002.gadi.nci.org.au                                                               ┊
┊                year ▻ 1999                                                                                             ┊
┊              in_dir ▻ /g/data/rt52/era5/pressure-levels/reanalysis/t/1999/*                                            ┊
┊            out_file ▻ /g/data/wb00/admin/testing/nci_5.625/test_test/temperature_1999_5.625.nc                         ┊
└────────────────────────────────────────────────────────────────────────────────────────────────────────────────────────┘
<xarray.Dataset>
Dimensions:    (longitude: 1440, latitude: 721, level: 37, time: 8760)
Coordinates:
  * longitude  (longitude) float32 -180.0 -179.8 -179.5 ... 179.2 179.5 179.8
  * latitude   (latitude) float32 90.0 89.75 89.5 89.25 ... -89.5 -89.75 -90.0
  * level      (level) int32 1 2 3 5 7 10 20 30 ... 850 875 900 925 950 975 1000
  * time       (time) datetime64[ns] 1999-01-01 ... 1999-12-31T23:00:00
Data variables:
    t          (time, level, latitude, longitude) float32 dask.array<chunksize=(4, 37, 721, 1440), meta=np.ndarray>
Attributes:
    Conventions:  CF-1.6
    history:      2020-10-23 15:19:08 UTC+1100 by era5_replication_tools-1.2....
    license:      Licence to use Copernicus Products: https://apps.ecmwf.int/...
    summary:      ERA5 is the fifth generation ECMWF atmospheric reanalysis o...
    title:        ERA5 pressure-levels oper temperature 19990101-19990131
━━━━━━━━━━━━━━━━━━━━━━━━━━━━━━━━━━━━━━━━━━━━━━━━━━━━━━━━━━━━━━━━━━━━━━━━━━━━━━━━━━━━━━━━━━━━━━━━━━━━━━━━━━━━━━━━━━━━━━━━━━


┌────────────────────────────────────────────────────────────────────────────────────────────────────────────────────────┐
┊                                                Mon Mar 27 19:22:45 2023                                                ┊
┊                rank ▻ 21                                                                                               ┊
┊                node ▻ gadi-mmem-clx-0002.gadi.nci.org.au                                                               ┊
┊                year ▻ 2000                                                                                             ┊
┊              in_dir ▻ /g/data/rt52/era5/pressure-levels/reanalysis/t/2000/*                                            ┊
┊            out_file ▻ /g/data/wb00/admin/testing/nci_5.625/test_test/temperature_2000_5.625.nc                         ┊
└────────────────────────────────────────────────────────────────────────────────────────────────────────────────────────┘
<xarray.Dataset>
Dimensions:    (longitude: 1440, latitude: 721, level: 37, time: 8784)
Coordinates:
  * longitude  (longitude) float32 -180.0 -179.8 -179.5 ... 179.2 179.5 179.8
  * latitude   (latitude) float32 90.0 89.75 89.5 89.25 ... -89.5 -89.75 -90.0
  * level      (level) int32 1 2 3 5 7 10 20 30 ... 850 875 900 925 950 975 1000
  * time       (time) datetime64[ns] 2000-01-01 ... 2000-12-31T23:00:00
Data variables:
    t          (time, level, latitude, longitude) float32 dask.array<chunksize=(4, 37, 721, 1440), meta=np.ndarray>
Attributes:
    Conventions:  CF-1.6
    license:      Licence to use Copernicus Products: https://apps.ecmwf.int/...
    summary:      ERA5 is the fifth generation ECMWF atmospheric reanalysis o...
    title:        ERA5 pressure-levels oper temperature 20000101-20000131
    history:      2021-01-08 07:37:20 UTC+1100 by era5_replication_tools-1.8....
━━━━━━━━━━━━━━━━━━━━━━━━━━━━━━━━━━━━━━━━━━━━━━━━━━━━━━━━━━━━━━━━━━━━━━━━━━━━━━━━━━━━━━━━━━━━━━━━━━━━━━━━━━━━━━━━━━━━━━━━━━


┌────────────────────────────────────────────────────────────────────────────────────────────────────────────────────────┐
┊                                                Mon Mar 27 19:22:47 2023                                                ┊
┊                rank ▻ 22                                                                                               ┊
┊                node ▻ gadi-mmem-clx-0002.gadi.nci.org.au                                                               ┊
┊                year ▻ 2001                                                                                             ┊
┊              in_dir ▻ /g/data/rt52/era5/pressure-levels/reanalysis/t/2001/*                                            ┊
┊            out_file ▻ /g/data/wb00/admin/testing/nci_5.625/test_test/temperature_2001_5.625.nc                         ┊
└────────────────────────────────────────────────────────────────────────────────────────────────────────────────────────┘
<xarray.Dataset>
Dimensions:    (longitude: 1440, latitude: 721, level: 37, time: 8760)
Coordinates:
  * longitude  (longitude) float32 -180.0 -179.8 -179.5 ... 179.2 179.5 179.8
  * latitude   (latitude) float32 90.0 89.75 89.5 89.25 ... -89.5 -89.75 -90.0
  * level      (level) int32 1 2 3 5 7 10 20 30 ... 850 875 900 925 950 975 1000
  * time       (time) datetime64[ns] 2001-01-01 ... 2001-12-31T23:00:00
Data variables:
    t          (time, level, latitude, longitude) float32 dask.array<chunksize=(4, 37, 721, 1440), meta=np.ndarray>
Attributes:
    Conventions:  CF-1.6
    license:      Licence to use Copernicus Products: https://apps.ecmwf.int/...
    summary:      ERA5 is the fifth generation ECMWF atmospheric reanalysis o...
    title:        ERA5 pressure-levels oper temperature 20010101-20010131
    history:      2021-01-08 07:37:32 UTC+1100 by era5_replication_tools-1.8....
━━━━━━━━━━━━━━━━━━━━━━━━━━━━━━━━━━━━━━━━━━━━━━━━━━━━━━━━━━━━━━━━━━━━━━━━━━━━━━━━━━━━━━━━━━━━━━━━━━━━━━━━━━━━━━━━━━━━━━━━━━


┌────────────────────────────────────────────────────────────────────────────────────────────────────────────────────────┐
┊                                                Mon Mar 27 19:22:49 2023                                                ┊
┊                rank ▻ 23                                                                                               ┊
┊                node ▻ gadi-mmem-clx-0002.gadi.nci.org.au                                                               ┊
┊                year ▻ 2002                                                                                             ┊
┊              in_dir ▻ /g/data/rt52/era5/pressure-levels/reanalysis/t/2002/*                                            ┊
┊            out_file ▻ /g/data/wb00/admin/testing/nci_5.625/test_test/temperature_2002_5.625.nc                         ┊
└────────────────────────────────────────────────────────────────────────────────────────────────────────────────────────┘
<xarray.Dataset>
Dimensions:    (longitude: 1440, latitude: 721, level: 37, time: 8760)
Coordinates:
  * longitude  (longitude) float32 -180.0 -179.8 -179.5 ... 179.2 179.5 179.8
  * latitude   (latitude) float32 90.0 89.75 89.5 89.25 ... -89.5 -89.75 -90.0
  * level      (level) int32 1 2 3 5 7 10 20 30 ... 850 875 900 925 950 975 1000
  * time       (time) datetime64[ns] 2002-01-01 ... 2002-12-31T23:00:00
Data variables:
    t          (time, level, latitude, longitude) float32 dask.array<chunksize=(4, 37, 721, 1440), meta=np.ndarray>
Attributes:
    Conventions:  CF-1.6
    history:      2020-11-10 22:43:35 UTC+1100 by era5_replication_tools-1.2....
    license:      Licence to use Copernicus Products: https://apps.ecmwf.int/...
    summary:      ERA5 is the fifth generation ECMWF atmospheric reanalysis o...
    title:        ERA5 pressure-levels oper temperature 20020101-20020131
━━━━━━━━━━━━━━━━━━━━━━━━━━━━━━━━━━━━━━━━━━━━━━━━━━━━━━━━━━━━━━━━━━━━━━━━━━━━━━━━━━━━━━━━━━━━━━━━━━━━━━━━━━━━━━━━━━━━━━━━━━


┌────────────────────────────────────────────────────────────────────────────────────────────────────────────────────────┐
┊                                                Mon Mar 27 19:22:51 2023                                                ┊
┊                rank ▻ 24                                                                                               ┊
┊                node ▻ gadi-mmem-clx-0002.gadi.nci.org.au                                                               ┊
┊                year ▻ 2003                                                                                             ┊
┊              in_dir ▻ /g/data/rt52/era5/pressure-levels/reanalysis/t/2003/*                                            ┊
┊            out_file ▻ /g/data/wb00/admin/testing/nci_5.625/test_test/temperature_2003_5.625.nc                         ┊
└────────────────────────────────────────────────────────────────────────────────────────────────────────────────────────┘
<xarray.Dataset>
Dimensions:    (longitude: 1440, latitude: 721, level: 37, time: 8760)
Coordinates:
  * longitude  (longitude) float32 -180.0 -179.8 -179.5 ... 179.2 179.5 179.8
  * latitude   (latitude) float32 90.0 89.75 89.5 89.25 ... -89.5 -89.75 -90.0
  * level      (level) int32 1 2 3 5 7 10 20 30 ... 850 875 900 925 950 975 1000
  * time       (time) datetime64[ns] 2003-01-01 ... 2003-12-31T23:00:00
Data variables:
    t          (time, level, latitude, longitude) float32 dask.array<chunksize=(4, 37, 721, 1440), meta=np.ndarray>
Attributes:
    Conventions:  CF-1.6
    license:      Licence to use Copernicus Products: https://apps.ecmwf.int/...
    summary:      ERA5 is the fifth generation ECMWF atmospheric reanalysis o...
    title:        ERA5 pressure-levels oper temperature 20030101-20030131
    history:      2021-01-08 07:37:39 UTC+1100 by era5_replication_tools-1.8....
━━━━━━━━━━━━━━━━━━━━━━━━━━━━━━━━━━━━━━━━━━━━━━━━━━━━━━━━━━━━━━━━━━━━━━━━━━━━━━━━━━━━━━━━━━━━━━━━━━━━━━━━━━━━━━━━━━━━━━━━━━


┌────────────────────────────────────────────────────────────────────────────────────────────────────────────────────────┐
┊                                                Mon Mar 27 19:22:53 2023                                                ┊
┊                rank ▻ 25                                                                                               ┊
┊                node ▻ gadi-mmem-clx-0002.gadi.nci.org.au                                                               ┊
┊                year ▻ 2004                                                                                             ┊
┊              in_dir ▻ /g/data/rt52/era5/pressure-levels/reanalysis/t/2004/*                                            ┊
┊            out_file ▻ /g/data/wb00/admin/testing/nci_5.625/test_test/temperature_2004_5.625.nc                         ┊
└────────────────────────────────────────────────────────────────────────────────────────────────────────────────────────┘
<xarray.Dataset>
Dimensions:    (longitude: 1440, latitude: 721, level: 37, time: 8784)
Coordinates:
  * longitude  (longitude) float32 -180.0 -179.8 -179.5 ... 179.2 179.5 179.8
  * latitude   (latitude) float32 90.0 89.75 89.5 89.25 ... -89.5 -89.75 -90.0
  * level      (level) int32 1 2 3 5 7 10 20 30 ... 850 875 900 925 950 975 1000
  * time       (time) datetime64[ns] 2004-01-01 ... 2004-12-31T23:00:00
Data variables:
    t          (time, level, latitude, longitude) float32 dask.array<chunksize=(4, 37, 721, 1440), meta=np.ndarray>
Attributes:
    Conventions:  CF-1.6
    license:      Licence to use Copernicus Products: https://apps.ecmwf.int/...
    summary:      ERA5 is the fifth generation ECMWF atmospheric reanalysis o...
    title:        ERA5 pressure-levels oper temperature 20040101-20040131
    history:      2021-01-08 07:37:47 UTC+1100 by era5_replication_tools-1.8....
━━━━━━━━━━━━━━━━━━━━━━━━━━━━━━━━━━━━━━━━━━━━━━━━━━━━━━━━━━━━━━━━━━━━━━━━━━━━━━━━━━━━━━━━━━━━━━━━━━━━━━━━━━━━━━━━━━━━━━━━━━


┌────────────────────────────────────────────────────────────────────────────────────────────────────────────────────────┐
┊                                                Mon Mar 27 19:22:55 2023                                                ┊
┊                rank ▻ 26                                                                                               ┊
┊                node ▻ gadi-mmem-clx-0002.gadi.nci.org.au                                                               ┊
┊                year ▻ 2005                                                                                             ┊
┊              in_dir ▻ /g/data/rt52/era5/pressure-levels/reanalysis/t/2005/*                                            ┊
┊            out_file ▻ /g/data/wb00/admin/testing/nci_5.625/test_test/temperature_2005_5.625.nc                         ┊
└────────────────────────────────────────────────────────────────────────────────────────────────────────────────────────┘
<xarray.Dataset>
Dimensions:    (longitude: 1440, latitude: 721, level: 37, time: 8760)
Coordinates:
  * longitude  (longitude) float32 -180.0 -179.8 -179.5 ... 179.2 179.5 179.8
  * latitude   (latitude) float32 90.0 89.75 89.5 89.25 ... -89.5 -89.75 -90.0
  * level      (level) int32 1 2 3 5 7 10 20 30 ... 850 875 900 925 950 975 1000
  * time       (time) datetime64[ns] 2005-01-01 ... 2005-12-31T23:00:00
Data variables:
    t          (time, level, latitude, longitude) float32 dask.array<chunksize=(4, 37, 721, 1440), meta=np.ndarray>
Attributes:
    Conventions:  CF-1.6
    history:      2020-11-08 19:03:04 UTC+1100 by era5_replication_tools-1.2....
    license:      Licence to use Copernicus Products: https://apps.ecmwf.int/...
    summary:      ERA5 is the fifth generation ECMWF atmospheric reanalysis o...
    title:        ERA5 pressure-levels oper temperature 20050101-20050131
━━━━━━━━━━━━━━━━━━━━━━━━━━━━━━━━━━━━━━━━━━━━━━━━━━━━━━━━━━━━━━━━━━━━━━━━━━━━━━━━━━━━━━━━━━━━━━━━━━━━━━━━━━━━━━━━━━━━━━━━━━


┌────────────────────────────────────────────────────────────────────────────────────────────────────────────────────────┐
┊                                                Mon Mar 27 19:22:57 2023                                                ┊
┊                rank ▻ 27                                                                                               ┊
┊                node ▻ gadi-mmem-clx-0002.gadi.nci.org.au                                                               ┊
┊                year ▻ 2006                                                                                             ┊
┊              in_dir ▻ /g/data/rt52/era5/pressure-levels/reanalysis/t/2006/*                                            ┊
┊            out_file ▻ /g/data/wb00/admin/testing/nci_5.625/test_test/temperature_2006_5.625.nc                         ┊
└────────────────────────────────────────────────────────────────────────────────────────────────────────────────────────┘
<xarray.Dataset>
Dimensions:    (longitude: 1440, latitude: 721, level: 37, time: 8760)
Coordinates:
  * longitude  (longitude) float32 -180.0 -179.8 -179.5 ... 179.2 179.5 179.8
  * latitude   (latitude) float32 90.0 89.75 89.5 89.25 ... -89.5 -89.75 -90.0
  * level      (level) int32 1 2 3 5 7 10 20 30 ... 850 875 900 925 950 975 1000
  * time       (time) datetime64[ns] 2006-01-01 ... 2006-12-31T23:00:00
Data variables:
    t          (time, level, latitude, longitude) float32 dask.array<chunksize=(4, 37, 721, 1440), meta=np.ndarray>
Attributes:
    Conventions:  CF-1.6
    history:      2020-11-08 02:43:11 UTC+1100 by era5_replication_tools-1.2....
    license:      Licence to use Copernicus Products: https://apps.ecmwf.int/...
    summary:      ERA5 is the fifth generation ECMWF atmospheric reanalysis o...
    title:        ERA5 pressure-levels oper temperature 20060101-20060131
━━━━━━━━━━━━━━━━━━━━━━━━━━━━━━━━━━━━━━━━━━━━━━━━━━━━━━━━━━━━━━━━━━━━━━━━━━━━━━━━━━━━━━━━━━━━━━━━━━━━━━━━━━━━━━━━━━━━━━━━━━


┌────────────────────────────────────────────────────────────────────────────────────────────────────────────────────────┐
┊                                                Mon Mar 27 19:22:59 2023                                                ┊
┊                rank ▻ 28                                                                                               ┊
┊                node ▻ gadi-mmem-clx-0002.gadi.nci.org.au                                                               ┊
┊                year ▻ 2007                                                                                             ┊
┊              in_dir ▻ /g/data/rt52/era5/pressure-levels/reanalysis/t/2007/*                                            ┊
┊            out_file ▻ /g/data/wb00/admin/testing/nci_5.625/test_test/temperature_2007_5.625.nc                         ┊
└────────────────────────────────────────────────────────────────────────────────────────────────────────────────────────┘
<xarray.Dataset>
Dimensions:    (longitude: 1440, latitude: 721, level: 37, time: 8760)
Coordinates:
  * longitude  (longitude) float32 -180.0 -179.8 -179.5 ... 179.2 179.5 179.8
  * latitude   (latitude) float32 90.0 89.75 89.5 89.25 ... -89.5 -89.75 -90.0
  * level      (level) int32 1 2 3 5 7 10 20 30 ... 850 875 900 925 950 975 1000
  * time       (time) datetime64[ns] 2007-01-01 ... 2007-12-31T23:00:00
Data variables:
    t          (time, level, latitude, longitude) float32 dask.array<chunksize=(4, 37, 721, 1440), meta=np.ndarray>
Attributes:
    Conventions:  CF-1.6
    history:      2020-10-22 21:53:16 UTC+1100 by era5_replication_tools-1.2....
    license:      Licence to use Copernicus Products: https://apps.ecmwf.int/...
    summary:      ERA5 is the fifth generation ECMWF atmospheric reanalysis o...
    title:        ERA5 pressure-levels oper temperature 20070101-20070131
━━━━━━━━━━━━━━━━━━━━━━━━━━━━━━━━━━━━━━━━━━━━━━━━━━━━━━━━━━━━━━━━━━━━━━━━━━━━━━━━━━━━━━━━━━━━━━━━━━━━━━━━━━━━━━━━━━━━━━━━━━


┌────────────────────────────────────────────────────────────────────────────────────────────────────────────────────────┐
┊                                                Mon Mar 27 19:23:01 2023                                                ┊
┊                rank ▻ 29                                                                                               ┊
┊                node ▻ gadi-mmem-clx-0002.gadi.nci.org.au                                                               ┊
┊                year ▻ 2008                                                                                             ┊
┊              in_dir ▻ /g/data/rt52/era5/pressure-levels/reanalysis/t/2008/*                                            ┊
┊            out_file ▻ /g/data/wb00/admin/testing/nci_5.625/test_test/temperature_2008_5.625.nc                         ┊
└────────────────────────────────────────────────────────────────────────────────────────────────────────────────────────┘
<xarray.Dataset>
Dimensions:    (longitude: 1440, latitude: 721, level: 37, time: 8784)
Coordinates:
  * longitude  (longitude) float32 -180.0 -179.8 -179.5 ... 179.2 179.5 179.8
  * latitude   (latitude) float32 90.0 89.75 89.5 89.25 ... -89.5 -89.75 -90.0
  * level      (level) int32 1 2 3 5 7 10 20 30 ... 850 875 900 925 950 975 1000
  * time       (time) datetime64[ns] 2008-01-01 ... 2008-12-31T23:00:00
Data variables:
    t          (time, level, latitude, longitude) float32 dask.array<chunksize=(4, 37, 721, 1440), meta=np.ndarray>
Attributes:
    Conventions:  CF-1.6
    history:      2020-11-25 21:00:16 UTC+1100 by era5_replication_tools-1.8....
    license:      Licence to use Copernicus Products: https://apps.ecmwf.int/...
    summary:      ERA5 is the fifth generation ECMWF atmospheric reanalysis o...
    title:        ERA5 pressure-levels oper temperature 20080101-20080131
━━━━━━━━━━━━━━━━━━━━━━━━━━━━━━━━━━━━━━━━━━━━━━━━━━━━━━━━━━━━━━━━━━━━━━━━━━━━━━━━━━━━━━━━━━━━━━━━━━━━━━━━━━━━━━━━━━━━━━━━━━


┌────────────────────────────────────────────────────────────────────────────────────────────────────────────────────────┐
┊                                                Mon Mar 27 19:23:03 2023                                                ┊
┊                rank ▻ 30                                                                                               ┊
┊                node ▻ gadi-mmem-clx-0002.gadi.nci.org.au                                                               ┊
┊                year ▻ 2009                                                                                             ┊
┊              in_dir ▻ /g/data/rt52/era5/pressure-levels/reanalysis/t/2009/*                                            ┊
┊            out_file ▻ /g/data/wb00/admin/testing/nci_5.625/test_test/temperature_2009_5.625.nc                         ┊
└────────────────────────────────────────────────────────────────────────────────────────────────────────────────────────┘
<xarray.Dataset>
Dimensions:    (longitude: 1440, latitude: 721, level: 37, time: 8760)
Coordinates:
  * longitude  (longitude) float32 -180.0 -179.8 -179.5 ... 179.2 179.5 179.8
  * latitude   (latitude) float32 90.0 89.75 89.5 89.25 ... -89.5 -89.75 -90.0
  * level      (level) int32 1 2 3 5 7 10 20 30 ... 850 875 900 925 950 975 1000
  * time       (time) datetime64[ns] 2009-01-01 ... 2009-12-31T23:00:00
Data variables:
    t          (time, level, latitude, longitude) float32 dask.array<chunksize=(4, 37, 721, 1440), meta=np.ndarray>
Attributes:
    Conventions:  CF-1.6
    history:      2020-11-25 07:51:38 UTC+1100 by era5_replication_tools-1.8....
    license:      Licence to use Copernicus Products: https://apps.ecmwf.int/...
    summary:      ERA5 is the fifth generation ECMWF atmospheric reanalysis o...
    title:        ERA5 pressure-levels oper temperature 20090101-20090131
━━━━━━━━━━━━━━━━━━━━━━━━━━━━━━━━━━━━━━━━━━━━━━━━━━━━━━━━━━━━━━━━━━━━━━━━━━━━━━━━━━━━━━━━━━━━━━━━━━━━━━━━━━━━━━━━━━━━━━━━━━


┌────────────────────────────────────────────────────────────────────────────────────────────────────────────────────────┐
┊                                                Mon Mar 27 19:23:05 2023                                                ┊
┊                rank ▻ 31                                                                                               ┊
┊                node ▻ gadi-mmem-clx-0002.gadi.nci.org.au                                                               ┊
┊                year ▻ 2010                                                                                             ┊
┊              in_dir ▻ /g/data/rt52/era5/pressure-levels/reanalysis/t/2010/*                                            ┊
┊            out_file ▻ /g/data/wb00/admin/testing/nci_5.625/test_test/temperature_2010_5.625.nc                         ┊
└────────────────────────────────────────────────────────────────────────────────────────────────────────────────────────┘
<xarray.Dataset>
Dimensions:    (longitude: 1440, latitude: 721, level: 37, time: 8760)
Coordinates:
  * longitude  (longitude) float32 -180.0 -179.8 -179.5 ... 179.2 179.5 179.8
  * latitude   (latitude) float32 90.0 89.75 89.5 89.25 ... -89.5 -89.75 -90.0
  * level      (level) int32 1 2 3 5 7 10 20 30 ... 850 875 900 925 950 975 1000
  * time       (time) datetime64[ns] 2010-01-01 ... 2010-12-31T23:00:00
Data variables:
    t          (time, level, latitude, longitude) float32 dask.array<chunksize=(4, 37, 721, 1440), meta=np.ndarray>
Attributes:
    Conventions:  CF-1.6
    history:      2020-11-24 19:53:13 UTC+1100 by era5_replication_tools-1.8....
    license:      Licence to use Copernicus Products: https://apps.ecmwf.int/...
    summary:      ERA5 is the fifth generation ECMWF atmospheric reanalysis o...
    title:        ERA5 pressure-levels oper temperature 20100101-20100131
━━━━━━━━━━━━━━━━━━━━━━━━━━━━━━━━━━━━━━━━━━━━━━━━━━━━━━━━━━━━━━━━━━━━━━━━━━━━━━━━━━━━━━━━━━━━━━━━━━━━━━━━━━━━━━━━━━━━━━━━━━


┌────────────────────────────────────────────────────────────────────────────────────────────────────────────────────────┐
┊                                                Mon Mar 27 19:23:07 2023                                                ┊
┊                rank ▻ 32                                                                                               ┊
┊                node ▻ gadi-mmem-clx-0002.gadi.nci.org.au                                                               ┊
┊                year ▻ 2011                                                                                             ┊
┊              in_dir ▻ /g/data/rt52/era5/pressure-levels/reanalysis/t/2011/*                                            ┊
┊            out_file ▻ /g/data/wb00/admin/testing/nci_5.625/test_test/temperature_2011_5.625.nc                         ┊
└────────────────────────────────────────────────────────────────────────────────────────────────────────────────────────┘
<xarray.Dataset>
Dimensions:    (longitude: 1440, latitude: 721, level: 37, time: 8760)
Coordinates:
  * longitude  (longitude) float32 -180.0 -179.8 -179.5 ... 179.2 179.5 179.8
  * latitude   (latitude) float32 90.0 89.75 89.5 89.25 ... -89.5 -89.75 -90.0
  * level      (level) int32 1 2 3 5 7 10 20 30 ... 850 875 900 925 950 975 1000
  * time       (time) datetime64[ns] 2011-01-01 ... 2011-12-31T23:00:00
Data variables:
    t          (time, level, latitude, longitude) float32 dask.array<chunksize=(4, 37, 721, 1440), meta=np.ndarray>
Attributes:
    Conventions:  CF-1.6
    history:      2020-11-24 05:38:42 UTC+1100 by era5_replication_tools-1.8....
    license:      Licence to use Copernicus Products: https://apps.ecmwf.int/...
    summary:      ERA5 is the fifth generation ECMWF atmospheric reanalysis o...
    title:        ERA5 pressure-levels oper temperature 20110101-20110131
━━━━━━━━━━━━━━━━━━━━━━━━━━━━━━━━━━━━━━━━━━━━━━━━━━━━━━━━━━━━━━━━━━━━━━━━━━━━━━━━━━━━━━━━━━━━━━━━━━━━━━━━━━━━━━━━━━━━━━━━━━


┌────────────────────────────────────────────────────────────────────────────────────────────────────────────────────────┐
┊                                                Mon Mar 27 19:23:09 2023                                                ┊
┊                rank ▻ 33                                                                                               ┊
┊                node ▻ gadi-mmem-clx-0002.gadi.nci.org.au                                                               ┊
┊                year ▻ 2012                                                                                             ┊
┊              in_dir ▻ /g/data/rt52/era5/pressure-levels/reanalysis/t/2012/*                                            ┊
┊            out_file ▻ /g/data/wb00/admin/testing/nci_5.625/test_test/temperature_2012_5.625.nc                         ┊
└────────────────────────────────────────────────────────────────────────────────────────────────────────────────────────┘
<xarray.Dataset>
Dimensions:    (longitude: 1440, latitude: 721, level: 37, time: 8784)
Coordinates:
  * longitude  (longitude) float32 -180.0 -179.8 -179.5 ... 179.2 179.5 179.8
  * latitude   (latitude) float32 90.0 89.75 89.5 89.25 ... -89.5 -89.75 -90.0
  * level      (level) int32 1 2 3 5 7 10 20 30 ... 850 875 900 925 950 975 1000
  * time       (time) datetime64[ns] 2012-01-01 ... 2012-12-31T23:00:00
Data variables:
    t          (time, level, latitude, longitude) float32 dask.array<chunksize=(4, 37, 721, 1440), meta=np.ndarray>
Attributes:
    Conventions:  CF-1.6
    history:      2020-11-23 14:27:04 UTC+1100 by era5_replication_tools-1.8....
    license:      Licence to use Copernicus Products: https://apps.ecmwf.int/...
    summary:      ERA5 is the fifth generation ECMWF atmospheric reanalysis o...
    title:        ERA5 pressure-levels oper temperature 20120101-20120131
━━━━━━━━━━━━━━━━━━━━━━━━━━━━━━━━━━━━━━━━━━━━━━━━━━━━━━━━━━━━━━━━━━━━━━━━━━━━━━━━━━━━━━━━━━━━━━━━━━━━━━━━━━━━━━━━━━━━━━━━━━


┌────────────────────────────────────────────────────────────────────────────────────────────────────────────────────────┐
┊                                                Mon Mar 27 19:23:11 2023                                                ┊
┊                rank ▻ 34                                                                                               ┊
┊                node ▻ gadi-mmem-clx-0002.gadi.nci.org.au                                                               ┊
┊                year ▻ 2013                                                                                             ┊
┊              in_dir ▻ /g/data/rt52/era5/pressure-levels/reanalysis/t/2013/*                                            ┊
┊            out_file ▻ /g/data/wb00/admin/testing/nci_5.625/test_test/temperature_2013_5.625.nc                         ┊
└────────────────────────────────────────────────────────────────────────────────────────────────────────────────────────┘
<xarray.Dataset>
Dimensions:    (longitude: 1440, latitude: 721, level: 37, time: 8760)
Coordinates:
  * longitude  (longitude) float32 -180.0 -179.8 -179.5 ... 179.2 179.5 179.8
  * latitude   (latitude) float32 90.0 89.75 89.5 89.25 ... -89.5 -89.75 -90.0
  * level      (level) int32 1 2 3 5 7 10 20 30 ... 850 875 900 925 950 975 1000
  * time       (time) datetime64[ns] 2013-01-01 ... 2013-12-31T23:00:00
Data variables:
    t          (time, level, latitude, longitude) float32 dask.array<chunksize=(4, 37, 721, 1440), meta=np.ndarray>
Attributes:
    Conventions:  CF-1.6
    history:      2020-11-22 20:21:19 UTC+1100 by era5_replication_tools-1.7....
    license:      Licence to use Copernicus Products: https://apps.ecmwf.int/...
    summary:      ERA5 is the fifth generation ECMWF atmospheric reanalysis o...
    title:        ERA5 pressure-levels oper temperature 20130101-20130131
━━━━━━━━━━━━━━━━━━━━━━━━━━━━━━━━━━━━━━━━━━━━━━━━━━━━━━━━━━━━━━━━━━━━━━━━━━━━━━━━━━━━━━━━━━━━━━━━━━━━━━━━━━━━━━━━━━━━━━━━━━


┌────────────────────────────────────────────────────────────────────────────────────────────────────────────────────────┐
┊                                                Mon Mar 27 19:23:13 2023                                                ┊
┊                rank ▻ 35                                                                                               ┊
┊                node ▻ gadi-mmem-clx-0002.gadi.nci.org.au                                                               ┊
┊                year ▻ 2014                                                                                             ┊
┊              in_dir ▻ /g/data/rt52/era5/pressure-levels/reanalysis/t/2014/*                                            ┊
┊            out_file ▻ /g/data/wb00/admin/testing/nci_5.625/test_test/temperature_2014_5.625.nc                         ┊
└────────────────────────────────────────────────────────────────────────────────────────────────────────────────────────┘
<xarray.Dataset>
Dimensions:    (longitude: 1440, latitude: 721, level: 37, time: 8760)
Coordinates:
  * longitude  (longitude) float32 -180.0 -179.8 -179.5 ... 179.2 179.5 179.8
  * latitude   (latitude) float32 90.0 89.75 89.5 89.25 ... -89.5 -89.75 -90.0
  * level      (level) int32 1 2 3 5 7 10 20 30 ... 850 875 900 925 950 975 1000
  * time       (time) datetime64[ns] 2014-01-01 ... 2014-12-31T23:00:00
Data variables:
    t          (time, level, latitude, longitude) float32 dask.array<chunksize=(4, 37, 721, 1440), meta=np.ndarray>
Attributes:
    Conventions:  CF-1.6
    history:      2020-11-22 00:25:39 UTC+1100 by era5_replication_tools-1.7....
    license:      Licence to use Copernicus Products: https://apps.ecmwf.int/...
    summary:      ERA5 is the fifth generation ECMWF atmospheric reanalysis o...
    title:        ERA5 pressure-levels oper temperature 20140101-20140131
━━━━━━━━━━━━━━━━━━━━━━━━━━━━━━━━━━━━━━━━━━━━━━━━━━━━━━━━━━━━━━━━━━━━━━━━━━━━━━━━━━━━━━━━━━━━━━━━━━━━━━━━━━━━━━━━━━━━━━━━━━


┌────────────────────────────────────────────────────────────────────────────────────────────────────────────────────────┐
┊                                                Mon Mar 27 19:23:15 2023                                                ┊
┊                rank ▻ 36                                                                                               ┊
┊                node ▻ gadi-mmem-clx-0002.gadi.nci.org.au                                                               ┊
┊                year ▻ 2015                                                                                             ┊
┊              in_dir ▻ /g/data/rt52/era5/pressure-levels/reanalysis/t/2015/*                                            ┊
┊            out_file ▻ /g/data/wb00/admin/testing/nci_5.625/test_test/temperature_2015_5.625.nc                         ┊
└────────────────────────────────────────────────────────────────────────────────────────────────────────────────────────┘
<xarray.Dataset>
Dimensions:    (longitude: 1440, latitude: 721, level: 37, time: 8760)
Coordinates:
  * longitude  (longitude) float32 -180.0 -179.8 -179.5 ... 179.2 179.5 179.8
  * latitude   (latitude) float32 90.0 89.75 89.5 89.25 ... -89.5 -89.75 -90.0
  * level      (level) int32 1 2 3 5 7 10 20 30 ... 850 875 900 925 950 975 1000
  * time       (time) datetime64[ns] 2015-01-01 ... 2015-12-31T23:00:00
Data variables:
    t          (time, level, latitude, longitude) float32 dask.array<chunksize=(4, 37, 721, 1440), meta=np.ndarray>
Attributes:
    Conventions:  CF-1.6
    history:      2020-11-21 01:05:59 UTC+1100 by era5_replication_tools-1.7....
    license:      Licence to use Copernicus Products: https://apps.ecmwf.int/...
    summary:      ERA5 is the fifth generation ECMWF atmospheric reanalysis o...
    title:        ERA5 pressure-levels oper temperature 20150101-20150131
━━━━━━━━━━━━━━━━━━━━━━━━━━━━━━━━━━━━━━━━━━━━━━━━━━━━━━━━━━━━━━━━━━━━━━━━━━━━━━━━━━━━━━━━━━━━━━━━━━━━━━━━━━━━━━━━━━━━━━━━━━


┌────────────────────────────────────────────────────────────────────────────────────────────────────────────────────────┐
┊                                                Mon Mar 27 19:23:17 2023                                                ┊
┊                rank ▻ 37                                                                                               ┊
┊                node ▻ gadi-mmem-clx-0002.gadi.nci.org.au                                                               ┊
┊                year ▻ 2016                                                                                             ┊
┊              in_dir ▻ /g/data/rt52/era5/pressure-levels/reanalysis/t/2016/*                                            ┊
┊            out_file ▻ /g/data/wb00/admin/testing/nci_5.625/test_test/temperature_2016_5.625.nc                         ┊
└────────────────────────────────────────────────────────────────────────────────────────────────────────────────────────┘
<xarray.Dataset>
Dimensions:    (longitude: 1440, latitude: 721, level: 37, time: 8784)
Coordinates:
  * longitude  (longitude) float32 -180.0 -179.8 -179.5 ... 179.2 179.5 179.8
  * latitude   (latitude) float32 90.0 89.75 89.5 89.25 ... -89.5 -89.75 -90.0
  * level      (level) int32 1 2 3 5 7 10 20 30 ... 850 875 900 925 950 975 1000
  * time       (time) datetime64[ns] 2016-01-01 ... 2016-12-31T23:00:00
Data variables:
    t          (time, level, latitude, longitude) float32 dask.array<chunksize=(4, 37, 721, 1440), meta=np.ndarray>
Attributes:
    Conventions:  CF-1.6
    history:      2020-11-20 01:38:39 UTC+1100 by era5_replication_tools-1.7....
    license:      Licence to use Copernicus Products: https://apps.ecmwf.int/...
    summary:      ERA5 is the fifth generation ECMWF atmospheric reanalysis o...
    title:        ERA5 pressure-levels oper temperature 20160101-20160131
━━━━━━━━━━━━━━━━━━━━━━━━━━━━━━━━━━━━━━━━━━━━━━━━━━━━━━━━━━━━━━━━━━━━━━━━━━━━━━━━━━━━━━━━━━━━━━━━━━━━━━━━━━━━━━━━━━━━━━━━━━


┌────────────────────────────────────────────────────────────────────────────────────────────────────────────────────────┐
┊                                                Mon Mar 27 19:23:19 2023                                                ┊
┊                rank ▻ 38                                                                                               ┊
┊                node ▻ gadi-mmem-clx-0002.gadi.nci.org.au                                                               ┊
┊                year ▻ 2017                                                                                             ┊
┊              in_dir ▻ /g/data/rt52/era5/pressure-levels/reanalysis/t/2017/*                                            ┊
┊            out_file ▻ /g/data/wb00/admin/testing/nci_5.625/test_test/temperature_2017_5.625.nc                         ┊
└────────────────────────────────────────────────────────────────────────────────────────────────────────────────────────┘
<xarray.Dataset>
Dimensions:    (longitude: 1440, latitude: 721, level: 37, time: 8760)
Coordinates:
  * longitude  (longitude) float32 -180.0 -179.8 -179.5 ... 179.2 179.5 179.8
  * latitude   (latitude) float32 90.0 89.75 89.5 89.25 ... -89.5 -89.75 -90.0
  * level      (level) int32 1 2 3 5 7 10 20 30 ... 850 875 900 925 950 975 1000
  * time       (time) datetime64[ns] 2017-01-01 ... 2017-12-31T23:00:00
Data variables:
    t          (time, level, latitude, longitude) float32 dask.array<chunksize=(4, 37, 721, 1440), meta=np.ndarray>
Attributes:
    Conventions:  CF-1.6
    history:      2020-11-18 22:39:35 UTC+1100 by era5_replication_tools-1.7....
    license:      Licence to use Copernicus Products: https://apps.ecmwf.int/...
    summary:      ERA5 is the fifth generation ECMWF atmospheric reanalysis o...
    title:        ERA5 pressure-levels oper temperature 20170101-20170131
━━━━━━━━━━━━━━━━━━━━━━━━━━━━━━━━━━━━━━━━━━━━━━━━━━━━━━━━━━━━━━━━━━━━━━━━━━━━━━━━━━━━━━━━━━━━━━━━━━━━━━━━━━━━━━━━━━━━━━━━━━


┌────────────────────────────────────────────────────────────────────────────────────────────────────────────────────────┐
┊                                                Mon Mar 27 19:23:21 2023                                                ┊
┊                rank ▻ 39                                                                                               ┊
┊                node ▻ gadi-mmem-clx-0002.gadi.nci.org.au                                                               ┊
┊                year ▻ 2018                                                                                             ┊
┊              in_dir ▻ /g/data/rt52/era5/pressure-levels/reanalysis/t/2018/*                                            ┊
┊            out_file ▻ /g/data/wb00/admin/testing/nci_5.625/test_test/temperature_2018_5.625.nc                         ┊
└────────────────────────────────────────────────────────────────────────────────────────────────────────────────────────┘
<xarray.Dataset>
Dimensions:    (longitude: 1440, latitude: 721, level: 37, time: 8760)
Coordinates:
  * longitude  (longitude) float32 -180.0 -179.8 -179.5 ... 179.2 179.5 179.8
  * latitude   (latitude) float32 90.0 89.75 89.5 89.25 ... -89.5 -89.75 -90.0
  * level      (level) int32 1 2 3 5 7 10 20 30 ... 850 875 900 925 950 975 1000
  * time       (time) datetime64[ns] 2018-01-01 ... 2018-12-31T23:00:00
Data variables:
    t          (time, level, latitude, longitude) float32 dask.array<chunksize=(4, 37, 721, 1440), meta=np.ndarray>
Attributes:
    Conventions:  CF-1.6
    history:      2020-11-17 23:08:39 UTC+1100 by era5_replication_tools-1.7....
    license:      Licence to use Copernicus Products: https://apps.ecmwf.int/...
    summary:      ERA5 is the fifth generation ECMWF atmospheric reanalysis o...
    title:        ERA5 pressure-levels oper temperature 20180101-20180131
━━━━━━━━━━━━━━━━━━━━━━━━━━━━━━━━━━━━━━━━━━━━━━━━━━━━━━━━━━━━━━━━━━━━━━━━━━━━━━━━━━━━━━━━━━━━━━━━━━━━━━━━━━━━━━━━━━━━━━━━━━


[Mon 27 21:31:08]  End rank: 38,     Out file: /g/data/wb00/admin/testing/nci_5.625/test_test/temperature_2017_5.625.nc                  

[Mon 27 21:31:42]  End rank: 27,     Out file: /g/data/wb00/admin/testing/nci_5.625/test_test/temperature_2006_5.625.nc                  

[Mon 27 21:32:12]  End rank: 11,     Out file: /g/data/wb00/admin/testing/nci_5.625/test_test/temperature_1990_5.625.nc                  

[Mon 27 21:34:01]  End rank: 33,     Out file: /g/data/wb00/admin/testing/nci_5.625/test_test/temperature_2012_5.625.nc                  

[Mon 27 21:35:02]  End rank: 35,     Out file: /g/data/wb00/admin/testing/nci_5.625/test_test/temperature_2014_5.625.nc                  

[Mon 27 21:35:15]  End rank: 37,     Out file: /g/data/wb00/admin/testing/nci_5.625/test_test/temperature_2016_5.625.nc                  

[Mon 27 21:37:30]  End rank: 10,     Out file: /g/data/wb00/admin/testing/nci_5.625/test_test/temperature_1989_5.625.nc                  

[Mon 27 21:38:27]  End rank: 25,     Out file: /g/data/wb00/admin/testing/nci_5.625/test_test/temperature_2004_5.625.nc                  

[Mon 27 21:39:31]  End rank: 30,     Out file: /g/data/wb00/admin/testing/nci_5.625/test_test/temperature_2009_5.625.nc                  

[Mon 27 21:45:26]  End rank: 7,      Out file: /g/data/wb00/admin/testing/nci_5.625/test_test/temperature_1986_5.625.nc                  

[Mon 27 22:25:24]  End rank: 21,     Out file: /g/data/wb00/admin/testing/nci_5.625/test_test/temperature_2000_5.625.nc                  

[Mon 27 22:44:31]  End rank: 22,     Out file: /g/data/wb00/admin/testing/nci_5.625/test_test/temperature_2001_5.625.nc                  

[Mon 27 23:29:27]  End rank: 32,     Out file: /g/data/wb00/admin/testing/nci_5.625/test_test/temperature_2011_5.625.nc                  

[Mon 27 23:34:01]  End rank: 36,     Out file: /g/data/wb00/admin/testing/nci_5.625/test_test/temperature_2015_5.625.nc                  

[Mon 27 23:36:34]  End rank: 12,     Out file: /g/data/wb00/admin/testing/nci_5.625/test_test/temperature_1991_5.625.nc                  

[Mon 27 23:57:12]  End rank: 17,     Out file: /g/data/wb00/admin/testing/nci_5.625/test_test/temperature_1996_5.625.nc                  

[Mon 27 23:58:52]  End rank: 39,     Out file: /g/data/wb00/admin/testing/nci_5.625/test_test/temperature_2018_5.625.nc                  

[Tue 28 00:02:27]  End rank: 23,     Out file: /g/data/wb00/admin/testing/nci_5.625/test_test/temperature_2002_5.625.nc                  

[Tue 28 00:06:42]  End rank: 31,     Out file: /g/data/wb00/admin/testing/nci_5.625/test_test/temperature_2010_5.625.nc                  

[Tue 28 00:17:08]  End rank: 18,     Out file: /g/data/wb00/admin/testing/nci_5.625/test_test/temperature_1997_5.625.nc                  

[Tue 28 00:20:01]  End rank: 13,     Out file: /g/data/wb00/admin/testing/nci_5.625/test_test/temperature_1992_5.625.nc                  

[Tue 28 00:21:17]  End rank: 28,     Out file: /g/data/wb00/admin/testing/nci_5.625/test_test/temperature_2007_5.625.nc                  

[Tue 28 00:24:20]  End rank: 19,     Out file: /g/data/wb00/admin/testing/nci_5.625/test_test/temperature_1998_5.625.nc                  

[Tue 28 00:31:24]  End rank: 34,     Out file: /g/data/wb00/admin/testing/nci_5.625/test_test/temperature_2013_5.625.nc                  

[Tue 28 00:32:12]  End rank: 15,     Out file: /g/data/wb00/admin/testing/nci_5.625/test_test/temperature_1994_5.625.nc                  

[Tue 28 00:33:38]  End rank: 14,     Out file: /g/data/wb00/admin/testing/nci_5.625/test_test/temperature_1993_5.625.nc                  

[Tue 28 00:40:34]  End rank: 9,      Out file: /g/data/wb00/admin/testing/nci_5.625/test_test/temperature_1988_5.625.nc                  

[Tue 28 00:43:46]  End rank: 29,     Out file: /g/data/wb00/admin/testing/nci_5.625/test_test/temperature_2008_5.625.nc                  

[Tue 28 00:44:51]  End rank: 4,      Out file: /g/data/wb00/admin/testing/nci_5.625/test_test/temperature_1983_5.625.nc                  

[Tue 28 01:05:05]  End rank: 1,      Out file: /g/data/wb00/admin/testing/nci_5.625/test_test/temperature_1980_5.625.nc                  

[Tue 28 01:17:12]  End rank: 0,      Out file: /g/data/wb00/admin/testing/nci_5.625/test_test/temperature_1979_5.625.nc                  

[Tue 28 01:21:50]  End rank: 26,     Out file: /g/data/wb00/admin/testing/nci_5.625/test_test/temperature_2005_5.625.nc                  

[Tue 28 01:24:43]  End rank: 5,      Out file: /g/data/wb00/admin/testing/nci_5.625/test_test/temperature_1984_5.625.nc                  

[Tue 28 01:33:14]  End rank: 24,     Out file: /g/data/wb00/admin/testing/nci_5.625/test_test/temperature_2003_5.625.nc                  

[Tue 28 01:47:12]  End rank: 20,     Out file: /g/data/wb00/admin/testing/nci_5.625/test_test/temperature_1999_5.625.nc                  

[Tue 28 01:51:51]  End rank: 8,      Out file: /g/data/wb00/admin/testing/nci_5.625/test_test/temperature_1987_5.625.nc                  

[Tue 28 02:01:05]  End rank: 16,     Out file: /g/data/wb00/admin/testing/nci_5.625/test_test/temperature_1995_5.625.nc                  

[Tue 28 02:01:30]  End rank: 6,      Out file: /g/data/wb00/admin/testing/nci_5.625/test_test/temperature_1985_5.625.nc                  

[Tue 28 02:28:44]  End rank: 2,      Out file: /g/data/wb00/admin/testing/nci_5.625/test_test/temperature_1981_5.625.nc                  

[Tue 28 02:57:42]  End rank: 3,      Out file: /g/data/wb00/admin/testing/nci_5.625/test_test/temperature_1982_5.625.nc                  

