2004
2004
/g/data/wb00/admin/testing/cds_era5/single-levels/reanalysis/tisr/2004
/g/data/wb00/admin/testing/cds_era5/single-levels/reanalysis/tisr/2004/tisr_era5_oper_sfc_20040101-20040131.nc
/g/data/wb00/admin/testing/cds_era5/single-levels/reanalysis/tisr/2004/tisr_era5_oper_sfc_20040201-20040228.nc
/g/data/wb00/admin/testing/cds_era5/single-levels/reanalysis/tisr/2004/tisr_era5_oper_sfc_20040301-20040331.nc
/g/data/wb00/admin/testing/cds_era5/single-levels/reanalysis/tisr/2004/tisr_era5_oper_sfc_20040401-20040430.nc
/g/data/wb00/admin/testing/cds_era5/single-levels/reanalysis/tisr/2004/tisr_era5_oper_sfc_20040501-20040531.nc
/g/data/wb00/admin/testing/cds_era5/single-levels/reanalysis/tisr/2004/tisr_era5_oper_sfc_20040601-20040630.nc
/g/data/wb00/admin/testing/cds_era5/single-levels/reanalysis/tisr/2004/tisr_era5_oper_sfc_20040701-20040731.nc
/g/data/wb00/admin/testing/cds_era5/single-levels/reanalysis/tisr/2004/tisr_era5_oper_sfc_20040801-20040831.nc
/g/data/wb00/admin/testing/cds_era5/single-levels/reanalysis/tisr/2004/tisr_era5_oper_sfc_20040901-20040930.nc
/g/data/wb00/admin/testing/cds_era5/single-levels/reanalysis/tisr/2004/tisr_era5_oper_sfc_20041001-20041031.nc
/g/data/wb00/admin/testing/cds_era5/single-levels/reanalysis/tisr/2004/tisr_era5_oper_sfc_20041101-20041130.nc
/g/data/wb00/admin/testing/cds_era5/single-levels/reanalysis/tisr/2004/tisr_era5_oper_sfc_20041201-20041231.nc

======================================================================================
                  Resource Usage on 2023-05-19 07:22:38:
   Job Id:             84184815.gadi-pbs
   Project:            fp0
   Exit Status:        0
   Service Units:      30.01
   NCPUs Requested:    1                      NCPUs Used: 1               
                                           CPU Time Used: 00:04:37        
   Memory Requested:   10.0GB                Memory Used: 4.32GB          
   Walltime requested: 10:00:00            Walltime Used: 06:00:04        
   JobFS requested:    10.0GB                 JobFS used: 0B              
======================================================================================
