2011
2011
/g/data/wb00/admin/testing/cds_era5/single-levels/reanalysis/tp/2011
/g/data/wb00/admin/testing/cds_era5/single-levels/reanalysis/tp/2011/tp_era5_oper_sfc_20110101-20110131.nc
/g/data/wb00/admin/testing/cds_era5/single-levels/reanalysis/tp/2011/tp_era5_oper_sfc_20110201-20110228.nc
/g/data/wb00/admin/testing/cds_era5/single-levels/reanalysis/tp/2011/tp_era5_oper_sfc_20110301-20110331.nc
/g/data/wb00/admin/testing/cds_era5/single-levels/reanalysis/tp/2011/tp_era5_oper_sfc_20110401-20110430.nc
/g/data/wb00/admin/testing/cds_era5/single-levels/reanalysis/tp/2011/tp_era5_oper_sfc_20110501-20110531.nc
/g/data/wb00/admin/testing/cds_era5/single-levels/reanalysis/tp/2011/tp_era5_oper_sfc_20110601-20110630.nc

======================================================================================
                  Resource Usage on 2023-05-20 18:17:30:
   Job Id:             84298159.gadi-pbs
   Project:            fp0
   Exit Status:        271 (Linux Signal 15 SIGTERM Termination)
   Service Units:      75.05
   NCPUs Requested:    1                      NCPUs Used: 1               
                                           CPU Time Used: 00:02:30        
   Memory Requested:   15.0GB                Memory Used: 3.35GB          
   Walltime requested: 10:00:00            Walltime Used: 10:00:26        
   JobFS requested:    10.0GB                 JobFS used: 0B              
======================================================================================
