num_cores: 96
╔════════════════════════════════════════════════════════════════════════════════════════════════════════════════════════╗
║ ╔════════════════════════════════════════════════════════════════════════════════════════════════════════════════════╗ ║
║ ║                                                    Common Param                                                    ║ ║
║ ║           ERA_param ▶ t                                                                                            ║ ║
║ ║    config_file_path ▶ /scratch/fp0/mah900/WeatherBench/pbs_scripts/config_test.yaml                                ║ ║
║ ║             out_deg ▶ 5.625000                                                                                     ║ ║
║ ║           algorithm ▶ bilinear                                                                                     ║ ║
║ ║      pressure_level ▶ [50, 100, 150, 200, 250, 300, 400, 500, 600, 700, 850, 925, 1000]                            ║ ║
║ ║       in_dir_prefix ▶ /g/data/rt52/era5/pressure-levels/reanalysis/t                                               ║ ║
║ ║     out_file_prefix ▶ /g/data/wb00/admin/testing/nci_5.625/test_test/temperature                                   ║ ║
║ ╚════════════════════════════════════════════════════════════════════════════════════════════════════════════════════╝ ║
╚════════════════════════════════════════════════════════════════════════════════════════════════════════════════════════╝


┌────────────────────────────────────────────────────────────────────────────────────────────────────────────────────────┐
┊                                                Wed Mar 29 05:04:26 2023                                                ┊
┊                rank ▻ 14                                                                                               ┊
┊                node ▻ gadi-mmem-clx-0003.gadi.nci.org.au                                                               ┊
┊                year ▻ 1993                                                                                             ┊
┊              in_dir ▻ /g/data/rt52/era5/pressure-levels/reanalysis/t/1993/*                                            ┊
┊            out_file ▻ /g/data/wb00/admin/testing/nci_5.625/test_test/temperature_1993_5.625.nc                         ┊
└────────────────────────────────────────────────────────────────────────────────────────────────────────────────────────┘
<xarray.Dataset>
Dimensions:    (longitude: 1440, latitude: 721, level: 37, time: 8760)
Coordinates:
  * longitude  (longitude) float32 -180.0 -179.8 -179.5 ... 179.2 179.5 179.8
  * latitude   (latitude) float32 90.0 89.75 89.5 89.25 ... -89.5 -89.75 -90.0
  * level      (level) int32 1 2 3 5 7 10 20 30 ... 850 875 900 925 950 975 1000
  * time       (time) datetime64[ns] 1993-01-01 ... 1993-12-31T23:00:00
Data variables:
    t          (time, level, latitude, longitude) float32 dask.array<chunksize=(744, 37, 721, 1440), meta=np.ndarray>
Attributes:
    Conventions:  CF-1.6
    history:      2020-10-28 17:11:58 UTC+1100 by era5_replication_tools-1.2....
    license:      Licence to use Copernicus Products: https://apps.ecmwf.int/...
    summary:      ERA5 is the fifth generation ECMWF atmospheric reanalysis o...
    title:        ERA5 pressure-levels oper temperature 19930101-19930131
[Wed 29 08:39:40]  End rank: 14,  Out file: /g/data/wb00/admin/testing/nci_5.625/test_test/temperature_1993_5.625.nc                      ( 215m, 14s)

┌────────────────────────────────────────────────────────────────────────────────────────────────────────────────────────┐
┊                                                Wed Mar 29 05:04:16 2023                                                ┊
┊                rank ▻ 9                                                                                                ┊
┊                node ▻ gadi-mmem-clx-0003.gadi.nci.org.au                                                               ┊
┊                year ▻ 1988                                                                                             ┊
┊              in_dir ▻ /g/data/rt52/era5/pressure-levels/reanalysis/t/1988/*                                            ┊
┊            out_file ▻ /g/data/wb00/admin/testing/nci_5.625/test_test/temperature_1988_5.625.nc                         ┊
└────────────────────────────────────────────────────────────────────────────────────────────────────────────────────────┘
<xarray.Dataset>
Dimensions:    (longitude: 1440, latitude: 721, level: 37, time: 8784)
Coordinates:
  * longitude  (longitude) float32 -180.0 -179.8 -179.5 ... 179.2 179.5 179.8
  * latitude   (latitude) float32 90.0 89.75 89.5 89.25 ... -89.5 -89.75 -90.0
  * level      (level) int32 1 2 3 5 7 10 20 30 ... 850 875 900 925 950 975 1000
  * time       (time) datetime64[ns] 1988-01-01 ... 1988-12-31T23:00:00
Data variables:
    t          (time, level, latitude, longitude) float32 dask.array<chunksize=(744, 37, 721, 1440), meta=np.ndarray>
Attributes:
    Conventions:  CF-1.6
    history:      2020-10-31 20:31:22 UTC+1100 by era5_replication_tools-1.2....
    license:      Licence to use Copernicus Products: https://apps.ecmwf.int/...
    summary:      ERA5 is the fifth generation ECMWF atmospheric reanalysis o...
    title:        ERA5 pressure-levels oper temperature 19880101-19880131
[Wed 29 10:43:59]  End rank: 9,   Out file: /g/data/wb00/admin/testing/nci_5.625/test_test/temperature_1988_5.625.nc                      ( 339m, 42s)

┌────────────────────────────────────────────────────────────────────────────────────────────────────────────────────────┐
┊                                                Wed Mar 29 05:05:04 2023                                                ┊
┊                rank ▻ 33                                                                                               ┊
┊                node ▻ gadi-mmem-clx-0003.gadi.nci.org.au                                                               ┊
┊                year ▻ 2012                                                                                             ┊
┊              in_dir ▻ /g/data/rt52/era5/pressure-levels/reanalysis/t/2012/*                                            ┊
┊            out_file ▻ /g/data/wb00/admin/testing/nci_5.625/test_test/temperature_2012_5.625.nc                         ┊
└────────────────────────────────────────────────────────────────────────────────────────────────────────────────────────┘
<xarray.Dataset>
Dimensions:    (longitude: 1440, latitude: 721, level: 37, time: 8784)
Coordinates:
  * longitude  (longitude) float32 -180.0 -179.8 -179.5 ... 179.2 179.5 179.8
  * latitude   (latitude) float32 90.0 89.75 89.5 89.25 ... -89.5 -89.75 -90.0
  * level      (level) int32 1 2 3 5 7 10 20 30 ... 850 875 900 925 950 975 1000
  * time       (time) datetime64[ns] 2012-01-01 ... 2012-12-31T23:00:00
Data variables:
    t          (time, level, latitude, longitude) float32 dask.array<chunksize=(744, 37, 721, 1440), meta=np.ndarray>
Attributes:
    Conventions:  CF-1.6
    history:      2020-11-23 14:27:04 UTC+1100 by era5_replication_tools-1.8....
    license:      Licence to use Copernicus Products: https://apps.ecmwf.int/...
    summary:      ERA5 is the fifth generation ECMWF atmospheric reanalysis o...
    title:        ERA5 pressure-levels oper temperature 20120101-20120131
[Wed 29 07:52:36]  End rank: 33,  Out file: /g/data/wb00/admin/testing/nci_5.625/test_test/temperature_2012_5.625.nc                      ( 167m, 32s)

┌────────────────────────────────────────────────────────────────────────────────────────────────────────────────────────┐
┊                                                Wed Mar 29 05:05:14 2023                                                ┊
┊                rank ▻ 38                                                                                               ┊
┊                node ▻ gadi-mmem-clx-0003.gadi.nci.org.au                                                               ┊
┊                year ▻ 2017                                                                                             ┊
┊              in_dir ▻ /g/data/rt52/era5/pressure-levels/reanalysis/t/2017/*                                            ┊
┊            out_file ▻ /g/data/wb00/admin/testing/nci_5.625/test_test/temperature_2017_5.625.nc                         ┊
└────────────────────────────────────────────────────────────────────────────────────────────────────────────────────────┘
<xarray.Dataset>
Dimensions:    (longitude: 1440, latitude: 721, level: 37, time: 8760)
Coordinates:
  * longitude  (longitude) float32 -180.0 -179.8 -179.5 ... 179.2 179.5 179.8
  * latitude   (latitude) float32 90.0 89.75 89.5 89.25 ... -89.5 -89.75 -90.0
  * level      (level) int32 1 2 3 5 7 10 20 30 ... 850 875 900 925 950 975 1000
  * time       (time) datetime64[ns] 2017-01-01 ... 2017-12-31T23:00:00
Data variables:
    t          (time, level, latitude, longitude) float32 dask.array<chunksize=(744, 37, 721, 1440), meta=np.ndarray>
Attributes:
    Conventions:  CF-1.6
    history:      2020-11-18 22:39:35 UTC+1100 by era5_replication_tools-1.7....
    license:      Licence to use Copernicus Products: https://apps.ecmwf.int/...
    summary:      ERA5 is the fifth generation ECMWF atmospheric reanalysis o...
    title:        ERA5 pressure-levels oper temperature 20170101-20170131
[Wed 29 07:46:55]  End rank: 38,  Out file: /g/data/wb00/admin/testing/nci_5.625/test_test/temperature_2017_5.625.nc                      ( 161m, 40s)

┌────────────────────────────────────────────────────────────────────────────────────────────────────────────────────────┐
┊                                                Wed Mar 29 05:04:18 2023                                                ┊
┊                rank ▻ 10                                                                                               ┊
┊                node ▻ gadi-mmem-clx-0003.gadi.nci.org.au                                                               ┊
┊                year ▻ 1989                                                                                             ┊
┊              in_dir ▻ /g/data/rt52/era5/pressure-levels/reanalysis/t/1989/*                                            ┊
┊            out_file ▻ /g/data/wb00/admin/testing/nci_5.625/test_test/temperature_1989_5.625.nc                         ┊
└────────────────────────────────────────────────────────────────────────────────────────────────────────────────────────┘
<xarray.Dataset>
Dimensions:    (longitude: 1440, latitude: 721, level: 37, time: 8760)
Coordinates:
  * longitude  (longitude) float32 -180.0 -179.8 -179.5 ... 179.2 179.5 179.8
  * latitude   (latitude) float32 90.0 89.75 89.5 89.25 ... -89.5 -89.75 -90.0
  * level      (level) int32 1 2 3 5 7 10 20 30 ... 850 875 900 925 950 975 1000
  * time       (time) datetime64[ns] 1989-01-01 ... 1989-12-31T23:00:00
Data variables:
    t          (time, level, latitude, longitude) float32 dask.array<chunksize=(744, 37, 721, 1440), meta=np.ndarray>
Attributes:
    Conventions:  CF-1.6
    history:      2020-10-31 02:56:40 UTC+1100 by era5_replication_tools-1.2....
    license:      Licence to use Copernicus Products: https://apps.ecmwf.int/...
    summary:      ERA5 is the fifth generation ECMWF atmospheric reanalysis o...
    title:        ERA5 pressure-levels oper temperature 19890101-19890131
[Wed 29 07:52:27]  End rank: 10,  Out file: /g/data/wb00/admin/testing/nci_5.625/test_test/temperature_1989_5.625.nc                      ( 168m,  9s)

┌────────────────────────────────────────────────────────────────────────────────────────────────────────────────────────┐
┊                                                Wed Mar 29 05:04:08 2023                                                ┊
┊                rank ▻ 5                                                                                                ┊
┊                node ▻ gadi-mmem-clx-0003.gadi.nci.org.au                                                               ┊
┊                year ▻ 1984                                                                                             ┊
┊              in_dir ▻ /g/data/rt52/era5/pressure-levels/reanalysis/t/1984/*                                            ┊
┊            out_file ▻ /g/data/wb00/admin/testing/nci_5.625/test_test/temperature_1984_5.625.nc                         ┊
└────────────────────────────────────────────────────────────────────────────────────────────────────────────────────────┘
<xarray.Dataset>
Dimensions:    (longitude: 1440, latitude: 721, level: 37, time: 8784)
Coordinates:
  * longitude  (longitude) float32 -180.0 -179.8 -179.5 ... 179.2 179.5 179.8
  * latitude   (latitude) float32 90.0 89.75 89.5 89.25 ... -89.5 -89.75 -90.0
  * level      (level) int32 1 2 3 5 7 10 20 30 ... 850 875 900 925 950 975 1000
  * time       (time) datetime64[ns] 1984-01-01 ... 1984-12-31T23:00:00
Data variables:
    t          (time, level, latitude, longitude) float32 dask.array<chunksize=(744, 37, 721, 1440), meta=np.ndarray>
Attributes:
    Conventions:  CF-1.6
    history:      2020-11-03 14:14:22 UTC+1100 by era5_replication_tools-1.2....
    license:      Licence to use Copernicus Products: https://apps.ecmwf.int/...
    summary:      ERA5 is the fifth generation ECMWF atmospheric reanalysis o...
    title:        ERA5 pressure-levels oper temperature 19840101-19840131
[Wed 29 12:02:32]  End rank: 5,   Out file: /g/data/wb00/admin/testing/nci_5.625/test_test/temperature_1984_5.625.nc                      ( 418m, 24s)

┌────────────────────────────────────────────────────────────────────────────────────────────────────────────────────────┐
┊                                                Wed Mar 29 05:04:32 2023                                                ┊
┊                rank ▻ 17                                                                                               ┊
┊                node ▻ gadi-mmem-clx-0003.gadi.nci.org.au                                                               ┊
┊                year ▻ 1996                                                                                             ┊
┊              in_dir ▻ /g/data/rt52/era5/pressure-levels/reanalysis/t/1996/*                                            ┊
┊            out_file ▻ /g/data/wb00/admin/testing/nci_5.625/test_test/temperature_1996_5.625.nc                         ┊
└────────────────────────────────────────────────────────────────────────────────────────────────────────────────────────┘
<xarray.Dataset>
Dimensions:    (longitude: 1440, latitude: 721, level: 37, time: 8784)
Coordinates:
  * longitude  (longitude) float32 -180.0 -179.8 -179.5 ... 179.2 179.5 179.8
  * latitude   (latitude) float32 90.0 89.75 89.5 89.25 ... -89.5 -89.75 -90.0
  * level      (level) int32 1 2 3 5 7 10 20 30 ... 850 875 900 925 950 975 1000
  * time       (time) datetime64[ns] 1996-01-01 ... 1996-12-31T23:00:00
Data variables:
    t          (time, level, latitude, longitude) float32 dask.array<chunksize=(744, 37, 721, 1440), meta=np.ndarray>
Attributes:
    Conventions:  CF-1.6
    history:      2021-08-26 22:59:41 UTC+1000 by era5_replication_tools-1.9....
    license:      Licence to use Copernicus Products: https://apps.ecmwf.int/...
    summary:      ERA5 is the fifth generation ECMWF atmospheric reanalysis o...
    title:        ERA5 pressure-levels oper temperature 19960101-19960131
[Wed 29 10:13:33]  End rank: 17,  Out file: /g/data/wb00/admin/testing/nci_5.625/test_test/temperature_1996_5.625.nc                      ( 309m,  0s)

┌────────────────────────────────────────────────────────────────────────────────────────────────────────────────────────┐
┊                                                Wed Mar 29 05:04:44 2023                                                ┊
┊                rank ▻ 23                                                                                               ┊
┊                node ▻ gadi-mmem-clx-0003.gadi.nci.org.au                                                               ┊
┊                year ▻ 2002                                                                                             ┊
┊              in_dir ▻ /g/data/rt52/era5/pressure-levels/reanalysis/t/2002/*                                            ┊
┊            out_file ▻ /g/data/wb00/admin/testing/nci_5.625/test_test/temperature_2002_5.625.nc                         ┊
└────────────────────────────────────────────────────────────────────────────────────────────────────────────────────────┘
<xarray.Dataset>
Dimensions:    (longitude: 1440, latitude: 721, level: 37, time: 8760)
Coordinates:
  * longitude  (longitude) float32 -180.0 -179.8 -179.5 ... 179.2 179.5 179.8
  * latitude   (latitude) float32 90.0 89.75 89.5 89.25 ... -89.5 -89.75 -90.0
  * level      (level) int32 1 2 3 5 7 10 20 30 ... 850 875 900 925 950 975 1000
  * time       (time) datetime64[ns] 2002-01-01 ... 2002-12-31T23:00:00
Data variables:
    t          (time, level, latitude, longitude) float32 dask.array<chunksize=(744, 37, 721, 1440), meta=np.ndarray>
Attributes:
    Conventions:  CF-1.6
    history:      2020-11-10 22:43:35 UTC+1100 by era5_replication_tools-1.2....
    license:      Licence to use Copernicus Products: https://apps.ecmwf.int/...
    summary:      ERA5 is the fifth generation ECMWF atmospheric reanalysis o...
    title:        ERA5 pressure-levels oper temperature 20020101-20020131
[Wed 29 09:06:20]  End rank: 23,  Out file: /g/data/wb00/admin/testing/nci_5.625/test_test/temperature_2002_5.625.nc                      ( 241m, 36s)

┌────────────────────────────────────────────────────────────────────────────────────────────────────────────────────────┐
┊                                                Wed Mar 29 05:05:00 2023                                                ┊
┊                rank ▻ 31                                                                                               ┊
┊                node ▻ gadi-mmem-clx-0003.gadi.nci.org.au                                                               ┊
┊                year ▻ 2010                                                                                             ┊
┊              in_dir ▻ /g/data/rt52/era5/pressure-levels/reanalysis/t/2010/*                                            ┊
┊            out_file ▻ /g/data/wb00/admin/testing/nci_5.625/test_test/temperature_2010_5.625.nc                         ┊
└────────────────────────────────────────────────────────────────────────────────────────────────────────────────────────┘
<xarray.Dataset>
Dimensions:    (longitude: 1440, latitude: 721, level: 37, time: 8760)
Coordinates:
  * longitude  (longitude) float32 -180.0 -179.8 -179.5 ... 179.2 179.5 179.8
  * latitude   (latitude) float32 90.0 89.75 89.5 89.25 ... -89.5 -89.75 -90.0
  * level      (level) int32 1 2 3 5 7 10 20 30 ... 850 875 900 925 950 975 1000
  * time       (time) datetime64[ns] 2010-01-01 ... 2010-12-31T23:00:00
Data variables:
    t          (time, level, latitude, longitude) float32 dask.array<chunksize=(744, 37, 721, 1440), meta=np.ndarray>
Attributes:
    Conventions:  CF-1.6
    history:      2020-11-24 19:53:13 UTC+1100 by era5_replication_tools-1.8....
    license:      Licence to use Copernicus Products: https://apps.ecmwf.int/...
    summary:      ERA5 is the fifth generation ECMWF atmospheric reanalysis o...
    title:        ERA5 pressure-levels oper temperature 20100101-20100131
[Wed 29 09:55:58]  End rank: 31,  Out file: /g/data/wb00/admin/testing/nci_5.625/test_test/temperature_2010_5.625.nc                      ( 290m, 57s)

┌────────────────────────────────────────────────────────────────────────────────────────────────────────────────────────┐
┊                                                Wed Mar 29 05:05:16 2023                                                ┊
┊                rank ▻ 39                                                                                               ┊
┊                node ▻ gadi-mmem-clx-0003.gadi.nci.org.au                                                               ┊
┊                year ▻ 2018                                                                                             ┊
┊              in_dir ▻ /g/data/rt52/era5/pressure-levels/reanalysis/t/2018/*                                            ┊
┊            out_file ▻ /g/data/wb00/admin/testing/nci_5.625/test_test/temperature_2018_5.625.nc                         ┊
└────────────────────────────────────────────────────────────────────────────────────────────────────────────────────────┘
<xarray.Dataset>
Dimensions:    (longitude: 1440, latitude: 721, level: 37, time: 8760)
Coordinates:
  * longitude  (longitude) float32 -180.0 -179.8 -179.5 ... 179.2 179.5 179.8
  * latitude   (latitude) float32 90.0 89.75 89.5 89.25 ... -89.5 -89.75 -90.0
  * level      (level) int32 1 2 3 5 7 10 20 30 ... 850 875 900 925 950 975 1000
  * time       (time) datetime64[ns] 2018-01-01 ... 2018-12-31T23:00:00
Data variables:
    t          (time, level, latitude, longitude) float32 dask.array<chunksize=(744, 37, 721, 1440), meta=np.ndarray>
Attributes:
    Conventions:  CF-1.6
    history:      2020-11-17 23:08:39 UTC+1100 by era5_replication_tools-1.7....
    license:      Licence to use Copernicus Products: https://apps.ecmwf.int/...
    summary:      ERA5 is the fifth generation ECMWF atmospheric reanalysis o...
    title:        ERA5 pressure-levels oper temperature 20180101-20180131
[Wed 29 10:33:52]  End rank: 39,  Out file: /g/data/wb00/admin/testing/nci_5.625/test_test/temperature_2018_5.625.nc                      ( 328m, 36s)

┌────────────────────────────────────────────────────────────────────────────────────────────────────────────────────────┐
┊                                                Wed Mar 29 05:04:30 2023                                                ┊
┊                rank ▻ 16                                                                                               ┊
┊                node ▻ gadi-mmem-clx-0003.gadi.nci.org.au                                                               ┊
┊                year ▻ 1995                                                                                             ┊
┊              in_dir ▻ /g/data/rt52/era5/pressure-levels/reanalysis/t/1995/*                                            ┊
┊            out_file ▻ /g/data/wb00/admin/testing/nci_5.625/test_test/temperature_1995_5.625.nc                         ┊
└────────────────────────────────────────────────────────────────────────────────────────────────────────────────────────┘
<xarray.Dataset>
Dimensions:    (longitude: 1440, latitude: 721, level: 37, time: 8760)
Coordinates:
  * longitude  (longitude) float32 -180.0 -179.8 -179.5 ... 179.2 179.5 179.8
  * latitude   (latitude) float32 90.0 89.75 89.5 89.25 ... -89.5 -89.75 -90.0
  * level      (level) int32 1 2 3 5 7 10 20 30 ... 850 875 900 925 950 975 1000
  * time       (time) datetime64[ns] 1995-01-01 ... 1995-12-31T23:00:00
Data variables:
    t          (time, level, latitude, longitude) float32 dask.array<chunksize=(744, 37, 721, 1440), meta=np.ndarray>
Attributes:
    Conventions:  CF-1.6
    history:      2020-10-27 07:51:22 UTC+1100 by era5_replication_tools-1.2....
    license:      Licence to use Copernicus Products: https://apps.ecmwf.int/...
    summary:      ERA5 is the fifth generation ECMWF atmospheric reanalysis o...
    title:        ERA5 pressure-levels oper temperature 19950101-19950131
[Wed 29 11:23:58]  End rank: 16,  Out file: /g/data/wb00/admin/testing/nci_5.625/test_test/temperature_1995_5.625.nc                      ( 379m, 27s)

┌────────────────────────────────────────────────────────────────────────────────────────────────────────────────────────┐
┊                                                Wed Mar 29 05:05:10 2023                                                ┊
┊                rank ▻ 36                                                                                               ┊
┊                node ▻ gadi-mmem-clx-0003.gadi.nci.org.au                                                               ┊
┊                year ▻ 2015                                                                                             ┊
┊              in_dir ▻ /g/data/rt52/era5/pressure-levels/reanalysis/t/2015/*                                            ┊
┊            out_file ▻ /g/data/wb00/admin/testing/nci_5.625/test_test/temperature_2015_5.625.nc                         ┊
└────────────────────────────────────────────────────────────────────────────────────────────────────────────────────────┘
<xarray.Dataset>
Dimensions:    (longitude: 1440, latitude: 721, level: 37, time: 8760)
Coordinates:
  * longitude  (longitude) float32 -180.0 -179.8 -179.5 ... 179.2 179.5 179.8
  * latitude   (latitude) float32 90.0 89.75 89.5 89.25 ... -89.5 -89.75 -90.0
  * level      (level) int32 1 2 3 5 7 10 20 30 ... 850 875 900 925 950 975 1000
  * time       (time) datetime64[ns] 2015-01-01 ... 2015-12-31T23:00:00
Data variables:
    t          (time, level, latitude, longitude) float32 dask.array<chunksize=(744, 37, 721, 1440), meta=np.ndarray>
Attributes:
    Conventions:  CF-1.6
    history:      2020-11-21 01:05:59 UTC+1100 by era5_replication_tools-1.7....
    license:      Licence to use Copernicus Products: https://apps.ecmwf.int/...
    summary:      ERA5 is the fifth generation ECMWF atmospheric reanalysis o...
    title:        ERA5 pressure-levels oper temperature 20150101-20150131
[Wed 29 09:33:06]  End rank: 36,  Out file: /g/data/wb00/admin/testing/nci_5.625/test_test/temperature_2015_5.625.nc                      ( 267m, 55s)

┌────────────────────────────────────────────────────────────────────────────────────────────────────────────────────────┐
┊                                                Wed Mar 29 05:04:20 2023                                                ┊
┊                rank ▻ 11                                                                                               ┊
┊                node ▻ gadi-mmem-clx-0003.gadi.nci.org.au                                                               ┊
┊                year ▻ 1990                                                                                             ┊
┊              in_dir ▻ /g/data/rt52/era5/pressure-levels/reanalysis/t/1990/*                                            ┊
┊            out_file ▻ /g/data/wb00/admin/testing/nci_5.625/test_test/temperature_1990_5.625.nc                         ┊
└────────────────────────────────────────────────────────────────────────────────────────────────────────────────────────┘
<xarray.Dataset>
Dimensions:    (longitude: 1440, latitude: 721, level: 37, time: 8760)
Coordinates:
  * longitude  (longitude) float32 -180.0 -179.8 -179.5 ... 179.2 179.5 179.8
  * latitude   (latitude) float32 90.0 89.75 89.5 89.25 ... -89.5 -89.75 -90.0
  * level      (level) int32 1 2 3 5 7 10 20 30 ... 850 875 900 925 950 975 1000
  * time       (time) datetime64[ns] 1990-01-01 ... 1990-12-31T23:00:00
Data variables:
    t          (time, level, latitude, longitude) float32 dask.array<chunksize=(744, 37, 721, 1440), meta=np.ndarray>
Attributes:
    Conventions:  CF-1.6
    history:      2020-10-30 12:10:29 UTC+1100 by era5_replication_tools-1.2....
    license:      Licence to use Copernicus Products: https://apps.ecmwf.int/...
    summary:      ERA5 is the fifth generation ECMWF atmospheric reanalysis o...
    title:        ERA5 pressure-levels oper temperature 19900101-19900131
[Wed 29 07:51:29]  End rank: 11,  Out file: /g/data/wb00/admin/testing/nci_5.625/test_test/temperature_1990_5.625.nc                      ( 167m,  8s)

┌────────────────────────────────────────────────────────────────────────────────────────────────────────────────────────┐
┊                                                Wed Mar 29 05:04:50 2023                                                ┊
┊                rank ▻ 26                                                                                               ┊
┊                node ▻ gadi-mmem-clx-0003.gadi.nci.org.au                                                               ┊
┊                year ▻ 2005                                                                                             ┊
┊              in_dir ▻ /g/data/rt52/era5/pressure-levels/reanalysis/t/2005/*                                            ┊
┊            out_file ▻ /g/data/wb00/admin/testing/nci_5.625/test_test/temperature_2005_5.625.nc                         ┊
└────────────────────────────────────────────────────────────────────────────────────────────────────────────────────────┘
<xarray.Dataset>
Dimensions:    (longitude: 1440, latitude: 721, level: 37, time: 8760)
Coordinates:
  * longitude  (longitude) float32 -180.0 -179.8 -179.5 ... 179.2 179.5 179.8
  * latitude   (latitude) float32 90.0 89.75 89.5 89.25 ... -89.5 -89.75 -90.0
  * level      (level) int32 1 2 3 5 7 10 20 30 ... 850 875 900 925 950 975 1000
  * time       (time) datetime64[ns] 2005-01-01 ... 2005-12-31T23:00:00
Data variables:
    t          (time, level, latitude, longitude) float32 dask.array<chunksize=(744, 37, 721, 1440), meta=np.ndarray>
Attributes:
    Conventions:  CF-1.6
    history:      2020-11-08 19:03:04 UTC+1100 by era5_replication_tools-1.2....
    license:      Licence to use Copernicus Products: https://apps.ecmwf.int/...
    summary:      ERA5 is the fifth generation ECMWF atmospheric reanalysis o...
    title:        ERA5 pressure-levels oper temperature 20050101-20050131
[Wed 29 10:30:43]  End rank: 26,  Out file: /g/data/wb00/admin/testing/nci_5.625/test_test/temperature_2005_5.625.nc                      ( 325m, 52s)

┌────────────────────────────────────────────────────────────────────────────────────────────────────────────────────────┐
┊                                                Wed Mar 29 05:04:56 2023                                                ┊
┊                rank ▻ 29                                                                                               ┊
┊                node ▻ gadi-mmem-clx-0003.gadi.nci.org.au                                                               ┊
┊                year ▻ 2008                                                                                             ┊
┊              in_dir ▻ /g/data/rt52/era5/pressure-levels/reanalysis/t/2008/*                                            ┊
┊            out_file ▻ /g/data/wb00/admin/testing/nci_5.625/test_test/temperature_2008_5.625.nc                         ┊
└────────────────────────────────────────────────────────────────────────────────────────────────────────────────────────┘
<xarray.Dataset>
Dimensions:    (longitude: 1440, latitude: 721, level: 37, time: 8784)
Coordinates:
  * longitude  (longitude) float32 -180.0 -179.8 -179.5 ... 179.2 179.5 179.8
  * latitude   (latitude) float32 90.0 89.75 89.5 89.25 ... -89.5 -89.75 -90.0
  * level      (level) int32 1 2 3 5 7 10 20 30 ... 850 875 900 925 950 975 1000
  * time       (time) datetime64[ns] 2008-01-01 ... 2008-12-31T23:00:00
Data variables:
    t          (time, level, latitude, longitude) float32 dask.array<chunksize=(744, 37, 721, 1440), meta=np.ndarray>
Attributes:
    Conventions:  CF-1.6
    history:      2020-11-25 21:00:16 UTC+1100 by era5_replication_tools-1.8....
    license:      Licence to use Copernicus Products: https://apps.ecmwf.int/...
    summary:      ERA5 is the fifth generation ECMWF atmospheric reanalysis o...
    title:        ERA5 pressure-levels oper temperature 20080101-20080131
[Wed 29 09:53:56]  End rank: 29,  Out file: /g/data/wb00/admin/testing/nci_5.625/test_test/temperature_2008_5.625.nc                      ( 288m, 59s)

┌────────────────────────────────────────────────────────────────────────────────────────────────────────────────────────┐
┊                                                Wed Mar 29 05:05:06 2023                                                ┊
┊                rank ▻ 34                                                                                               ┊
┊                node ▻ gadi-mmem-clx-0003.gadi.nci.org.au                                                               ┊
┊                year ▻ 2013                                                                                             ┊
┊              in_dir ▻ /g/data/rt52/era5/pressure-levels/reanalysis/t/2013/*                                            ┊
┊            out_file ▻ /g/data/wb00/admin/testing/nci_5.625/test_test/temperature_2013_5.625.nc                         ┊
└────────────────────────────────────────────────────────────────────────────────────────────────────────────────────────┘
<xarray.Dataset>
Dimensions:    (longitude: 1440, latitude: 721, level: 37, time: 8760)
Coordinates:
  * longitude  (longitude) float32 -180.0 -179.8 -179.5 ... 179.2 179.5 179.8
  * latitude   (latitude) float32 90.0 89.75 89.5 89.25 ... -89.5 -89.75 -90.0
  * level      (level) int32 1 2 3 5 7 10 20 30 ... 850 875 900 925 950 975 1000
  * time       (time) datetime64[ns] 2013-01-01 ... 2013-12-31T23:00:00
Data variables:
    t          (time, level, latitude, longitude) float32 dask.array<chunksize=(744, 37, 721, 1440), meta=np.ndarray>
Attributes:
    Conventions:  CF-1.6
    history:      2020-11-22 20:21:19 UTC+1100 by era5_replication_tools-1.7....
    license:      Licence to use Copernicus Products: https://apps.ecmwf.int/...
    summary:      ERA5 is the fifth generation ECMWF atmospheric reanalysis o...
    title:        ERA5 pressure-levels oper temperature 20130101-20130131
[Wed 29 09:26:21]  End rank: 34,  Out file: /g/data/wb00/admin/testing/nci_5.625/test_test/temperature_2013_5.625.nc                      ( 261m, 15s)

┌────────────────────────────────────────────────────────────────────────────────────────────────────────────────────────┐
┊                                                Wed Mar 29 05:04:28 2023                                                ┊
┊                rank ▻ 15                                                                                               ┊
┊                node ▻ gadi-mmem-clx-0003.gadi.nci.org.au                                                               ┊
┊                year ▻ 1994                                                                                             ┊
┊              in_dir ▻ /g/data/rt52/era5/pressure-levels/reanalysis/t/1994/*                                            ┊
┊            out_file ▻ /g/data/wb00/admin/testing/nci_5.625/test_test/temperature_1994_5.625.nc                         ┊
└────────────────────────────────────────────────────────────────────────────────────────────────────────────────────────┘
<xarray.Dataset>
Dimensions:    (longitude: 1440, latitude: 721, level: 37, time: 8760)
Coordinates:
  * longitude  (longitude) float32 -180.0 -179.8 -179.5 ... 179.2 179.5 179.8
  * latitude   (latitude) float32 90.0 89.75 89.5 89.25 ... -89.5 -89.75 -90.0
  * level      (level) int32 1 2 3 5 7 10 20 30 ... 850 875 900 925 950 975 1000
  * time       (time) datetime64[ns] 1994-01-01 ... 1994-12-31T23:00:00
Data variables:
    t          (time, level, latitude, longitude) float32 dask.array<chunksize=(744, 37, 721, 1440), meta=np.ndarray>
Attributes:
    Conventions:  CF-1.6
    history:      2020-10-28 01:17:09 UTC+1100 by era5_replication_tools-1.2....
    license:      Licence to use Copernicus Products: https://apps.ecmwf.int/...
    summary:      ERA5 is the fifth generation ECMWF atmospheric reanalysis o...
    title:        ERA5 pressure-levels oper temperature 19940101-19940131
[Wed 29 09:29:59]  End rank: 15,  Out file: /g/data/wb00/admin/testing/nci_5.625/test_test/temperature_1994_5.625.nc                      ( 265m, 30s)

┌────────────────────────────────────────────────────────────────────────────────────────────────────────────────────────┐
┊                                                Wed Mar 29 05:05:02 2023                                                ┊
┊                rank ▻ 32                                                                                               ┊
┊                node ▻ gadi-mmem-clx-0003.gadi.nci.org.au                                                               ┊
┊                year ▻ 2011                                                                                             ┊
┊              in_dir ▻ /g/data/rt52/era5/pressure-levels/reanalysis/t/2011/*                                            ┊
┊            out_file ▻ /g/data/wb00/admin/testing/nci_5.625/test_test/temperature_2011_5.625.nc                         ┊
└────────────────────────────────────────────────────────────────────────────────────────────────────────────────────────┘
<xarray.Dataset>
Dimensions:    (longitude: 1440, latitude: 721, level: 37, time: 8760)
Coordinates:
  * longitude  (longitude) float32 -180.0 -179.8 -179.5 ... 179.2 179.5 179.8
  * latitude   (latitude) float32 90.0 89.75 89.5 89.25 ... -89.5 -89.75 -90.0
  * level      (level) int32 1 2 3 5 7 10 20 30 ... 850 875 900 925 950 975 1000
  * time       (time) datetime64[ns] 2011-01-01 ... 2011-12-31T23:00:00
Data variables:
    t          (time, level, latitude, longitude) float32 dask.array<chunksize=(744, 37, 721, 1440), meta=np.ndarray>
Attributes:
    Conventions:  CF-1.6
    history:      2020-11-24 05:38:42 UTC+1100 by era5_replication_tools-1.8....
    license:      Licence to use Copernicus Products: https://apps.ecmwf.int/...
    summary:      ERA5 is the fifth generation ECMWF atmospheric reanalysis o...
    title:        ERA5 pressure-levels oper temperature 20110101-20110131
[Wed 29 08:59:28]  End rank: 32,  Out file: /g/data/wb00/admin/testing/nci_5.625/test_test/temperature_2011_5.625.nc                      ( 234m, 26s)

┌────────────────────────────────────────────────────────────────────────────────────────────────────────────────────────┐
┊                                                Wed Mar 29 05:04:22 2023                                                ┊
┊                rank ▻ 12                                                                                               ┊
┊                node ▻ gadi-mmem-clx-0003.gadi.nci.org.au                                                               ┊
┊                year ▻ 1991                                                                                             ┊
┊              in_dir ▻ /g/data/rt52/era5/pressure-levels/reanalysis/t/1991/*                                            ┊
┊            out_file ▻ /g/data/wb00/admin/testing/nci_5.625/test_test/temperature_1991_5.625.nc                         ┊
└────────────────────────────────────────────────────────────────────────────────────────────────────────────────────────┘
<xarray.Dataset>
Dimensions:    (longitude: 1440, latitude: 721, level: 37, time: 8760)
Coordinates:
  * longitude  (longitude) float32 -180.0 -179.8 -179.5 ... 179.2 179.5 179.8
  * latitude   (latitude) float32 90.0 89.75 89.5 89.25 ... -89.5 -89.75 -90.0
  * level      (level) int32 1 2 3 5 7 10 20 30 ... 850 875 900 925 950 975 1000
  * time       (time) datetime64[ns] 1991-01-01 ... 1991-12-31T23:00:00
Data variables:
    t          (time, level, latitude, longitude) float32 dask.array<chunksize=(744, 37, 721, 1440), meta=np.ndarray>
Attributes:
    Conventions:  CF-1.6
    history:      2020-10-29 20:21:35 UTC+1100 by era5_replication_tools-1.2....
    license:      Licence to use Copernicus Products: https://apps.ecmwf.int/...
    summary:      ERA5 is the fifth generation ECMWF atmospheric reanalysis o...
    title:        ERA5 pressure-levels oper temperature 19910101-19910131
[Wed 29 10:44:56]  End rank: 12,  Out file: /g/data/wb00/admin/testing/nci_5.625/test_test/temperature_1991_5.625.nc                      ( 340m, 33s)

┌────────────────────────────────────────────────────────────────────────────────────────────────────────────────────────┐
┊                                                Wed Mar 29 05:04:10 2023                                                ┊
┊                rank ▻ 6                                                                                                ┊
┊                node ▻ gadi-mmem-clx-0003.gadi.nci.org.au                                                               ┊
┊                year ▻ 1985                                                                                             ┊
┊              in_dir ▻ /g/data/rt52/era5/pressure-levels/reanalysis/t/1985/*                                            ┊
┊            out_file ▻ /g/data/wb00/admin/testing/nci_5.625/test_test/temperature_1985_5.625.nc                         ┊
└────────────────────────────────────────────────────────────────────────────────────────────────────────────────────────┘
<xarray.Dataset>
Dimensions:    (longitude: 1440, latitude: 721, level: 37, time: 8760)
Coordinates:
  * longitude  (longitude) float32 -180.0 -179.8 -179.5 ... 179.2 179.5 179.8
  * latitude   (latitude) float32 90.0 89.75 89.5 89.25 ... -89.5 -89.75 -90.0
  * level      (level) int32 1 2 3 5 7 10 20 30 ... 850 875 900 925 950 975 1000
  * time       (time) datetime64[ns] 1985-01-01 ... 1985-12-31T23:00:00
Data variables:
    t          (time, level, latitude, longitude) float32 dask.array<chunksize=(744, 37, 721, 1440), meta=np.ndarray>
Attributes:
    Conventions:  CF-1.6
    history:      2020-11-02 20:05:29 UTC+1100 by era5_replication_tools-1.2....
    license:      Licence to use Copernicus Products: https://apps.ecmwf.int/...
    summary:      ERA5 is the fifth generation ECMWF atmospheric reanalysis o...
    title:        ERA5 pressure-levels oper temperature 19850101-19850131
[Wed 29 11:08:51]  End rank: 6,   Out file: /g/data/wb00/admin/testing/nci_5.625/test_test/temperature_1985_5.625.nc                      ( 364m, 41s)

┌────────────────────────────────────────────────────────────────────────────────────────────────────────────────────────┐
┊                                                Wed Mar 29 05:04:02 2023                                                ┊
┊                rank ▻ 2                                                                                                ┊
┊                node ▻ gadi-mmem-clx-0003.gadi.nci.org.au                                                               ┊
┊                year ▻ 1981                                                                                             ┊
┊              in_dir ▻ /g/data/rt52/era5/pressure-levels/reanalysis/t/1981/*                                            ┊
┊            out_file ▻ /g/data/wb00/admin/testing/nci_5.625/test_test/temperature_1981_5.625.nc                         ┊
└────────────────────────────────────────────────────────────────────────────────────────────────────────────────────────┘
<xarray.Dataset>
Dimensions:    (longitude: 1440, latitude: 721, level: 37, time: 8760)
Coordinates:
  * longitude  (longitude) float32 -180.0 -179.8 -179.5 ... 179.2 179.5 179.8
  * latitude   (latitude) float32 90.0 89.75 89.5 89.25 ... -89.5 -89.75 -90.0
  * level      (level) int32 1 2 3 5 7 10 20 30 ... 850 875 900 925 950 975 1000
  * time       (time) datetime64[ns] 1981-01-01 ... 1981-12-31T23:00:00
Data variables:
    t          (time, level, latitude, longitude) float32 dask.array<chunksize=(744, 37, 721, 1440), meta=np.ndarray>
Attributes:
    Conventions:  CF-1.6
    history:      2020-11-05 21:33:12 UTC+1100 by era5_replication_tools-1.2....
    license:      Licence to use Copernicus Products: https://apps.ecmwf.int/...
    summary:      ERA5 is the fifth generation ECMWF atmospheric reanalysis o...
    title:        ERA5 pressure-levels oper temperature 19810101-19810131
[Wed 29 12:35:06]  End rank: 2,   Out file: /g/data/wb00/admin/testing/nci_5.625/test_test/temperature_1981_5.625.nc                      ( 451m,  4s)

┌────────────────────────────────────────────────────────────────────────────────────────────────────────────────────────┐
┊                                                Wed Mar 29 05:05:08 2023                                                ┊
┊                rank ▻ 35                                                                                               ┊
┊                node ▻ gadi-mmem-clx-0003.gadi.nci.org.au                                                               ┊
┊                year ▻ 2014                                                                                             ┊
┊              in_dir ▻ /g/data/rt52/era5/pressure-levels/reanalysis/t/2014/*                                            ┊
┊            out_file ▻ /g/data/wb00/admin/testing/nci_5.625/test_test/temperature_2014_5.625.nc                         ┊
└────────────────────────────────────────────────────────────────────────────────────────────────────────────────────────┘
<xarray.Dataset>
Dimensions:    (longitude: 1440, latitude: 721, level: 37, time: 8760)
Coordinates:
  * longitude  (longitude) float32 -180.0 -179.8 -179.5 ... 179.2 179.5 179.8
  * latitude   (latitude) float32 90.0 89.75 89.5 89.25 ... -89.5 -89.75 -90.0
  * level      (level) int32 1 2 3 5 7 10 20 30 ... 850 875 900 925 950 975 1000
  * time       (time) datetime64[ns] 2014-01-01 ... 2014-12-31T23:00:00
Data variables:
    t          (time, level, latitude, longitude) float32 dask.array<chunksize=(744, 37, 721, 1440), meta=np.ndarray>
Attributes:
    Conventions:  CF-1.6
    history:      2020-11-22 00:25:39 UTC+1100 by era5_replication_tools-1.7....
    license:      Licence to use Copernicus Products: https://apps.ecmwf.int/...
    summary:      ERA5 is the fifth generation ECMWF atmospheric reanalysis o...
    title:        ERA5 pressure-levels oper temperature 20140101-20140131
[Wed 29 07:52:31]  End rank: 35,  Out file: /g/data/wb00/admin/testing/nci_5.625/test_test/temperature_2014_5.625.nc                      ( 167m, 22s)

┌────────────────────────────────────────────────────────────────────────────────────────────────────────────────────────┐
┊                                                Wed Mar 29 05:04:34 2023                                                ┊
┊                rank ▻ 18                                                                                               ┊
┊                node ▻ gadi-mmem-clx-0003.gadi.nci.org.au                                                               ┊
┊                year ▻ 1997                                                                                             ┊
┊              in_dir ▻ /g/data/rt52/era5/pressure-levels/reanalysis/t/1997/*                                            ┊
┊            out_file ▻ /g/data/wb00/admin/testing/nci_5.625/test_test/temperature_1997_5.625.nc                         ┊
└────────────────────────────────────────────────────────────────────────────────────────────────────────────────────────┘
<xarray.Dataset>
Dimensions:    (longitude: 1440, latitude: 721, level: 37, time: 8760)
Coordinates:
  * longitude  (longitude) float32 -180.0 -179.8 -179.5 ... 179.2 179.5 179.8
  * latitude   (latitude) float32 90.0 89.75 89.5 89.25 ... -89.5 -89.75 -90.0
  * level      (level) int32 1 2 3 5 7 10 20 30 ... 850 875 900 925 950 975 1000
  * time       (time) datetime64[ns] 1997-01-01 ... 1997-12-31T23:00:00
Data variables:
    t          (time, level, latitude, longitude) float32 dask.array<chunksize=(744, 37, 721, 1440), meta=np.ndarray>
Attributes:
    Conventions:  CF-1.6
    history:      2020-10-25 01:54:23 UTC+1100 by era5_replication_tools-1.2....
    license:      Licence to use Copernicus Products: https://apps.ecmwf.int/...
    summary:      ERA5 is the fifth generation ECMWF atmospheric reanalysis o...
    title:        ERA5 pressure-levels oper temperature 19970101-19970131
[Wed 29 10:43:01]  End rank: 18,  Out file: /g/data/wb00/admin/testing/nci_5.625/test_test/temperature_1997_5.625.nc                      ( 338m, 27s)

┌────────────────────────────────────────────────────────────────────────────────────────────────────────────────────────┐
┊                                                Wed Mar 29 05:04:48 2023                                                ┊
┊                rank ▻ 25                                                                                               ┊
┊                node ▻ gadi-mmem-clx-0003.gadi.nci.org.au                                                               ┊
┊                year ▻ 2004                                                                                             ┊
┊              in_dir ▻ /g/data/rt52/era5/pressure-levels/reanalysis/t/2004/*                                            ┊
┊            out_file ▻ /g/data/wb00/admin/testing/nci_5.625/test_test/temperature_2004_5.625.nc                         ┊
└────────────────────────────────────────────────────────────────────────────────────────────────────────────────────────┘
<xarray.Dataset>
Dimensions:    (longitude: 1440, latitude: 721, level: 37, time: 8784)
Coordinates:
  * longitude  (longitude) float32 -180.0 -179.8 -179.5 ... 179.2 179.5 179.8
  * latitude   (latitude) float32 90.0 89.75 89.5 89.25 ... -89.5 -89.75 -90.0
  * level      (level) int32 1 2 3 5 7 10 20 30 ... 850 875 900 925 950 975 1000
  * time       (time) datetime64[ns] 2004-01-01 ... 2004-12-31T23:00:00
Data variables:
    t          (time, level, latitude, longitude) float32 dask.array<chunksize=(744, 37, 721, 1440), meta=np.ndarray>
Attributes:
    Conventions:  CF-1.6
    license:      Licence to use Copernicus Products: https://apps.ecmwf.int/...
    summary:      ERA5 is the fifth generation ECMWF atmospheric reanalysis o...
    title:        ERA5 pressure-levels oper temperature 20040101-20040131
    history:      2021-01-08 07:37:47 UTC+1100 by era5_replication_tools-1.8....
[Wed 29 07:56:11]  End rank: 25,  Out file: /g/data/wb00/admin/testing/nci_5.625/test_test/temperature_2004_5.625.nc                      ( 171m, 22s)

┌────────────────────────────────────────────────────────────────────────────────────────────────────────────────────────┐
┊                                                Wed Mar 29 05:03:55 2023                                                ┊
┊                rank ▻ 0                                                                                                ┊
┊                node ▻ gadi-mmem-clx-0003.gadi.nci.org.au                                                               ┊
┊                year ▻ 1979                                                                                             ┊
┊              in_dir ▻ /g/data/rt52/era5/pressure-levels/reanalysis/t/1979/*                                            ┊
┊            out_file ▻ /g/data/wb00/admin/testing/nci_5.625/test_test/temperature_1979_5.625.nc                         ┊
└────────────────────────────────────────────────────────────────────────────────────────────────────────────────────────┘
<xarray.Dataset>
Dimensions:    (longitude: 1440, latitude: 721, level: 37, time: 8760)
Coordinates:
  * longitude  (longitude) float32 -180.0 -179.8 -179.5 ... 179.2 179.5 179.8
  * latitude   (latitude) float32 90.0 89.75 89.5 89.25 ... -89.5 -89.75 -90.0
  * level      (level) int32 1 2 3 5 7 10 20 30 ... 850 875 900 925 950 975 1000
  * time       (time) datetime64[ns] 1979-01-01 ... 1979-12-31T23:00:00
Data variables:
    t          (time, level, latitude, longitude) float32 dask.array<chunksize=(744, 37, 721, 1440), meta=np.ndarray>
Attributes:
    Conventions:  CF-1.6
    license:      Licence to use Copernicus Products: https://apps.ecmwf.int/...
    summary:      ERA5 is the fifth generation ECMWF atmospheric reanalysis o...
    title:        ERA5 pressure-levels oper temperature 19790101-19790131
    history:      2021-01-08 07:36:24 UTC+1100 by era5_replication_tools-1.8....
[Wed 29 11:43:23]  End rank: 0,   Out file: /g/data/wb00/admin/testing/nci_5.625/test_test/temperature_1979_5.625.nc                      ( 399m, 27s)

┌────────────────────────────────────────────────────────────────────────────────────────────────────────────────────────┐
┊                                                Wed Mar 29 05:04:14 2023                                                ┊
┊                rank ▻ 8                                                                                                ┊
┊                node ▻ gadi-mmem-clx-0003.gadi.nci.org.au                                                               ┊
┊                year ▻ 1987                                                                                             ┊
┊              in_dir ▻ /g/data/rt52/era5/pressure-levels/reanalysis/t/1987/*                                            ┊
┊            out_file ▻ /g/data/wb00/admin/testing/nci_5.625/test_test/temperature_1987_5.625.nc                         ┊
└────────────────────────────────────────────────────────────────────────────────────────────────────────────────────────┘
<xarray.Dataset>
Dimensions:    (longitude: 1440, latitude: 721, level: 37, time: 8760)
Coordinates:
  * longitude  (longitude) float32 -180.0 -179.8 -179.5 ... 179.2 179.5 179.8
  * latitude   (latitude) float32 90.0 89.75 89.5 89.25 ... -89.5 -89.75 -90.0
  * level      (level) int32 1 2 3 5 7 10 20 30 ... 850 875 900 925 950 975 1000
  * time       (time) datetime64[ns] 1987-01-01 ... 1987-12-31T23:00:00
Data variables:
    t          (time, level, latitude, longitude) float32 dask.array<chunksize=(744, 37, 721, 1440), meta=np.ndarray>
Attributes:
    Conventions:  CF-1.6
    history:      2020-11-01 13:33:06 UTC+1100 by era5_replication_tools-1.2....
    license:      Licence to use Copernicus Products: https://apps.ecmwf.int/...
    summary:      ERA5 is the fifth generation ECMWF atmospheric reanalysis o...
    title:        ERA5 pressure-levels oper temperature 19870101-19870131
[Wed 29 10:06:01]  End rank: 8,   Out file: /g/data/wb00/admin/testing/nci_5.625/test_test/temperature_1987_5.625.nc                      ( 301m, 46s)

┌────────────────────────────────────────────────────────────────────────────────────────────────────────────────────────┐
┊                                                Wed Mar 29 05:04:00 2023                                                ┊
┊                rank ▻ 1                                                                                                ┊
┊                node ▻ gadi-mmem-clx-0003.gadi.nci.org.au                                                               ┊
┊                year ▻ 1980                                                                                             ┊
┊              in_dir ▻ /g/data/rt52/era5/pressure-levels/reanalysis/t/1980/*                                            ┊
┊            out_file ▻ /g/data/wb00/admin/testing/nci_5.625/test_test/temperature_1980_5.625.nc                         ┊
└────────────────────────────────────────────────────────────────────────────────────────────────────────────────────────┘
<xarray.Dataset>
Dimensions:    (longitude: 1440, latitude: 721, level: 37, time: 8784)
Coordinates:
  * longitude  (longitude) float32 -180.0 -179.8 -179.5 ... 179.2 179.5 179.8
  * latitude   (latitude) float32 90.0 89.75 89.5 89.25 ... -89.5 -89.75 -90.0
  * level      (level) int32 1 2 3 5 7 10 20 30 ... 850 875 900 925 950 975 1000
  * time       (time) datetime64[ns] 1980-01-01 ... 1980-12-31T23:00:00
Data variables:
    t          (time, level, latitude, longitude) float32 dask.array<chunksize=(744, 37, 721, 1440), meta=np.ndarray>
Attributes:
    Conventions:  CF-1.6
    history:      2020-11-06 15:50:54 UTC+1100 by era5_replication_tools-1.2....
    license:      Licence to use Copernicus Products: https://apps.ecmwf.int/...
    summary:      ERA5 is the fifth generation ECMWF atmospheric reanalysis o...
    title:        ERA5 pressure-levels oper temperature 19800101-19800131
[Wed 29 10:52:08]  End rank: 1,   Out file: /g/data/wb00/admin/testing/nci_5.625/test_test/temperature_1980_5.625.nc                      ( 348m,  8s)

┌────────────────────────────────────────────────────────────────────────────────────────────────────────────────────────┐
┊                                                Wed Mar 29 05:04:38 2023                                                ┊
┊                rank ▻ 20                                                                                               ┊
┊                node ▻ gadi-mmem-clx-0003.gadi.nci.org.au                                                               ┊
┊                year ▻ 1999                                                                                             ┊
┊              in_dir ▻ /g/data/rt52/era5/pressure-levels/reanalysis/t/1999/*                                            ┊
┊            out_file ▻ /g/data/wb00/admin/testing/nci_5.625/test_test/temperature_1999_5.625.nc                         ┊
└────────────────────────────────────────────────────────────────────────────────────────────────────────────────────────┘
<xarray.Dataset>
Dimensions:    (longitude: 1440, latitude: 721, level: 37, time: 8760)
Coordinates:
  * longitude  (longitude) float32 -180.0 -179.8 -179.5 ... 179.2 179.5 179.8
  * latitude   (latitude) float32 90.0 89.75 89.5 89.25 ... -89.5 -89.75 -90.0
  * level      (level) int32 1 2 3 5 7 10 20 30 ... 850 875 900 925 950 975 1000
  * time       (time) datetime64[ns] 1999-01-01 ... 1999-12-31T23:00:00
Data variables:
    t          (time, level, latitude, longitude) float32 dask.array<chunksize=(744, 37, 721, 1440), meta=np.ndarray>
Attributes:
    Conventions:  CF-1.6
    history:      2020-10-23 15:19:08 UTC+1100 by era5_replication_tools-1.2....
    license:      Licence to use Copernicus Products: https://apps.ecmwf.int/...
    summary:      ERA5 is the fifth generation ECMWF atmospheric reanalysis o...
    title:        ERA5 pressure-levels oper temperature 19990101-19990131
[Wed 29 11:32:17]  End rank: 20,  Out file: /g/data/wb00/admin/testing/nci_5.625/test_test/temperature_1999_5.625.nc                      ( 387m, 38s)

┌────────────────────────────────────────────────────────────────────────────────────────────────────────────────────────┐
┊                                                Wed Mar 29 05:04:46 2023                                                ┊
┊                rank ▻ 24                                                                                               ┊
┊                node ▻ gadi-mmem-clx-0003.gadi.nci.org.au                                                               ┊
┊                year ▻ 2003                                                                                             ┊
┊              in_dir ▻ /g/data/rt52/era5/pressure-levels/reanalysis/t/2003/*                                            ┊
┊            out_file ▻ /g/data/wb00/admin/testing/nci_5.625/test_test/temperature_2003_5.625.nc                         ┊
└────────────────────────────────────────────────────────────────────────────────────────────────────────────────────────┘
<xarray.Dataset>
Dimensions:    (longitude: 1440, latitude: 721, level: 37, time: 8760)
Coordinates:
  * longitude  (longitude) float32 -180.0 -179.8 -179.5 ... 179.2 179.5 179.8
  * latitude   (latitude) float32 90.0 89.75 89.5 89.25 ... -89.5 -89.75 -90.0
  * level      (level) int32 1 2 3 5 7 10 20 30 ... 850 875 900 925 950 975 1000
  * time       (time) datetime64[ns] 2003-01-01 ... 2003-12-31T23:00:00
Data variables:
    t          (time, level, latitude, longitude) float32 dask.array<chunksize=(744, 37, 721, 1440), meta=np.ndarray>
Attributes:
    Conventions:  CF-1.6
    license:      Licence to use Copernicus Products: https://apps.ecmwf.int/...
    summary:      ERA5 is the fifth generation ECMWF atmospheric reanalysis o...
    title:        ERA5 pressure-levels oper temperature 20030101-20030131
    history:      2021-01-08 07:37:39 UTC+1100 by era5_replication_tools-1.8....
[Wed 29 10:41:43]  End rank: 24,  Out file: /g/data/wb00/admin/testing/nci_5.625/test_test/temperature_2003_5.625.nc                      ( 336m, 57s)

┌────────────────────────────────────────────────────────────────────────────────────────────────────────────────────────┐
┊                                                Wed Mar 29 05:05:12 2023                                                ┊
┊                rank ▻ 37                                                                                               ┊
┊                node ▻ gadi-mmem-clx-0003.gadi.nci.org.au                                                               ┊
┊                year ▻ 2016                                                                                             ┊
┊              in_dir ▻ /g/data/rt52/era5/pressure-levels/reanalysis/t/2016/*                                            ┊
┊            out_file ▻ /g/data/wb00/admin/testing/nci_5.625/test_test/temperature_2016_5.625.nc                         ┊
└────────────────────────────────────────────────────────────────────────────────────────────────────────────────────────┘
<xarray.Dataset>
Dimensions:    (longitude: 1440, latitude: 721, level: 37, time: 8784)
Coordinates:
  * longitude  (longitude) float32 -180.0 -179.8 -179.5 ... 179.2 179.5 179.8
  * latitude   (latitude) float32 90.0 89.75 89.5 89.25 ... -89.5 -89.75 -90.0
  * level      (level) int32 1 2 3 5 7 10 20 30 ... 850 875 900 925 950 975 1000
  * time       (time) datetime64[ns] 2016-01-01 ... 2016-12-31T23:00:00
Data variables:
    t          (time, level, latitude, longitude) float32 dask.array<chunksize=(744, 37, 721, 1440), meta=np.ndarray>
Attributes:
    Conventions:  CF-1.6
    history:      2020-11-20 01:38:39 UTC+1100 by era5_replication_tools-1.7....
    license:      Licence to use Copernicus Products: https://apps.ecmwf.int/...
    summary:      ERA5 is the fifth generation ECMWF atmospheric reanalysis o...
    title:        ERA5 pressure-levels oper temperature 20160101-20160131
[Wed 29 07:55:00]  End rank: 37,  Out file: /g/data/wb00/admin/testing/nci_5.625/test_test/temperature_2016_5.625.nc                      ( 169m, 47s)

┌────────────────────────────────────────────────────────────────────────────────────────────────────────────────────────┐
┊                                                Wed Mar 29 05:04:58 2023                                                ┊
┊                rank ▻ 30                                                                                               ┊
┊                node ▻ gadi-mmem-clx-0003.gadi.nci.org.au                                                               ┊
┊                year ▻ 2009                                                                                             ┊
┊              in_dir ▻ /g/data/rt52/era5/pressure-levels/reanalysis/t/2009/*                                            ┊
┊            out_file ▻ /g/data/wb00/admin/testing/nci_5.625/test_test/temperature_2009_5.625.nc                         ┊
└────────────────────────────────────────────────────────────────────────────────────────────────────────────────────────┘
<xarray.Dataset>
Dimensions:    (longitude: 1440, latitude: 721, level: 37, time: 8760)
Coordinates:
  * longitude  (longitude) float32 -180.0 -179.8 -179.5 ... 179.2 179.5 179.8
  * latitude   (latitude) float32 90.0 89.75 89.5 89.25 ... -89.5 -89.75 -90.0
  * level      (level) int32 1 2 3 5 7 10 20 30 ... 850 875 900 925 950 975 1000
  * time       (time) datetime64[ns] 2009-01-01 ... 2009-12-31T23:00:00
Data variables:
    t          (time, level, latitude, longitude) float32 dask.array<chunksize=(744, 37, 721, 1440), meta=np.ndarray>
Attributes:
    Conventions:  CF-1.6
    history:      2020-11-25 07:51:38 UTC+1100 by era5_replication_tools-1.8....
    license:      Licence to use Copernicus Products: https://apps.ecmwf.int/...
    summary:      ERA5 is the fifth generation ECMWF atmospheric reanalysis o...
    title:        ERA5 pressure-levels oper temperature 20090101-20090131
[Wed 29 07:59:05]  End rank: 30,  Out file: /g/data/wb00/admin/testing/nci_5.625/test_test/temperature_2009_5.625.nc                      ( 174m,  7s)

┌────────────────────────────────────────────────────────────────────────────────────────────────────────────────────────┐
┊                                                Wed Mar 29 05:04:42 2023                                                ┊
┊                rank ▻ 22                                                                                               ┊
┊                node ▻ gadi-mmem-clx-0003.gadi.nci.org.au                                                               ┊
┊                year ▻ 2001                                                                                             ┊
┊              in_dir ▻ /g/data/rt52/era5/pressure-levels/reanalysis/t/2001/*                                            ┊
┊            out_file ▻ /g/data/wb00/admin/testing/nci_5.625/test_test/temperature_2001_5.625.nc                         ┊
└────────────────────────────────────────────────────────────────────────────────────────────────────────────────────────┘
<xarray.Dataset>
Dimensions:    (longitude: 1440, latitude: 721, level: 37, time: 8760)
Coordinates:
  * longitude  (longitude) float32 -180.0 -179.8 -179.5 ... 179.2 179.5 179.8
  * latitude   (latitude) float32 90.0 89.75 89.5 89.25 ... -89.5 -89.75 -90.0
  * level      (level) int32 1 2 3 5 7 10 20 30 ... 850 875 900 925 950 975 1000
  * time       (time) datetime64[ns] 2001-01-01 ... 2001-12-31T23:00:00
Data variables:
    t          (time, level, latitude, longitude) float32 dask.array<chunksize=(744, 37, 721, 1440), meta=np.ndarray>
Attributes:
    Conventions:  CF-1.6
    license:      Licence to use Copernicus Products: https://apps.ecmwf.int/...
    summary:      ERA5 is the fifth generation ECMWF atmospheric reanalysis o...
    title:        ERA5 pressure-levels oper temperature 20010101-20010131
    history:      2021-01-08 07:37:32 UTC+1100 by era5_replication_tools-1.8....
[Wed 29 09:22:04]  End rank: 22,  Out file: /g/data/wb00/admin/testing/nci_5.625/test_test/temperature_2001_5.625.nc                      ( 257m, 21s)

┌────────────────────────────────────────────────────────────────────────────────────────────────────────────────────────┐
┊                                                Wed Mar 29 05:04:12 2023                                                ┊
┊                rank ▻ 7                                                                                                ┊
┊                node ▻ gadi-mmem-clx-0003.gadi.nci.org.au                                                               ┊
┊                year ▻ 1986                                                                                             ┊
┊              in_dir ▻ /g/data/rt52/era5/pressure-levels/reanalysis/t/1986/*                                            ┊
┊            out_file ▻ /g/data/wb00/admin/testing/nci_5.625/test_test/temperature_1986_5.625.nc                         ┊
└────────────────────────────────────────────────────────────────────────────────────────────────────────────────────────┘
<xarray.Dataset>
Dimensions:    (longitude: 1440, latitude: 721, level: 37, time: 8760)
Coordinates:
  * longitude  (longitude) float32 -180.0 -179.8 -179.5 ... 179.2 179.5 179.8
  * latitude   (latitude) float32 90.0 89.75 89.5 89.25 ... -89.5 -89.75 -90.0
  * level      (level) int32 1 2 3 5 7 10 20 30 ... 850 875 900 925 950 975 1000
  * time       (time) datetime64[ns] 1986-01-01 ... 1986-12-31T23:00:00
Data variables:
    t          (time, level, latitude, longitude) float32 dask.array<chunksize=(744, 37, 721, 1440), meta=np.ndarray>
Attributes:
    Conventions:  CF-1.6
    history:      2020-11-02 04:20:05 UTC+1100 by era5_replication_tools-1.2....
    license:      Licence to use Copernicus Products: https://apps.ecmwf.int/...
    summary:      ERA5 is the fifth generation ECMWF atmospheric reanalysis o...
    title:        ERA5 pressure-levels oper temperature 19860101-19860131
[Wed 29 08:01:38]  End rank: 7,   Out file: /g/data/wb00/admin/testing/nci_5.625/test_test/temperature_1986_5.625.nc                      ( 177m, 26s)

┌────────────────────────────────────────────────────────────────────────────────────────────────────────────────────────┐
┊                                                Wed Mar 29 05:04:36 2023                                                ┊
┊                rank ▻ 19                                                                                               ┊
┊                node ▻ gadi-mmem-clx-0003.gadi.nci.org.au                                                               ┊
┊                year ▻ 1998                                                                                             ┊
┊              in_dir ▻ /g/data/rt52/era5/pressure-levels/reanalysis/t/1998/*                                            ┊
┊            out_file ▻ /g/data/wb00/admin/testing/nci_5.625/test_test/temperature_1998_5.625.nc                         ┊
└────────────────────────────────────────────────────────────────────────────────────────────────────────────────────────┘
<xarray.Dataset>
Dimensions:    (longitude: 1440, latitude: 721, level: 37, time: 8760)
Coordinates:
  * longitude  (longitude) float32 -180.0 -179.8 -179.5 ... 179.2 179.5 179.8
  * latitude   (latitude) float32 90.0 89.75 89.5 89.25 ... -89.5 -89.75 -90.0
  * level      (level) int32 1 2 3 5 7 10 20 30 ... 850 875 900 925 950 975 1000
  * time       (time) datetime64[ns] 1998-01-01 ... 1998-12-31T23:00:00
Data variables:
    t          (time, level, latitude, longitude) float32 dask.array<chunksize=(744, 37, 721, 1440), meta=np.ndarray>
Attributes:
    Conventions:  CF-1.6
    history:      2020-10-24 08:42:38 UTC+1100 by era5_replication_tools-1.2....
    license:      Licence to use Copernicus Products: https://apps.ecmwf.int/...
    summary:      ERA5 is the fifth generation ECMWF atmospheric reanalysis o...
    title:        ERA5 pressure-levels oper temperature 19980101-19980131
[Wed 29 09:16:50]  End rank: 19,  Out file: /g/data/wb00/admin/testing/nci_5.625/test_test/temperature_1998_5.625.nc                      ( 252m, 13s)

┌────────────────────────────────────────────────────────────────────────────────────────────────────────────────────────┐
┊                                                Wed Mar 29 05:04:04 2023                                                ┊
┊                rank ▻ 3                                                                                                ┊
┊                node ▻ gadi-mmem-clx-0003.gadi.nci.org.au                                                               ┊
┊                year ▻ 1982                                                                                             ┊
┊              in_dir ▻ /g/data/rt52/era5/pressure-levels/reanalysis/t/1982/*                                            ┊
┊            out_file ▻ /g/data/wb00/admin/testing/nci_5.625/test_test/temperature_1982_5.625.nc                         ┊
└────────────────────────────────────────────────────────────────────────────────────────────────────────────────────────┘
<xarray.Dataset>
Dimensions:    (longitude: 1440, latitude: 721, level: 37, time: 8760)
Coordinates:
  * longitude  (longitude) float32 -180.0 -179.8 -179.5 ... 179.2 179.5 179.8
  * latitude   (latitude) float32 90.0 89.75 89.5 89.25 ... -89.5 -89.75 -90.0
  * level      (level) int32 1 2 3 5 7 10 20 30 ... 850 875 900 925 950 975 1000
  * time       (time) datetime64[ns] 1982-01-01 ... 1982-12-31T23:00:00
Data variables:
    t          (time, level, latitude, longitude) float32 dask.array<chunksize=(744, 37, 721, 1440), meta=np.ndarray>
Attributes:
    Conventions:  CF-1.6
    history:      2020-11-04 23:37:17 UTC+1100 by era5_replication_tools-1.2....
    license:      Licence to use Copernicus Products: https://apps.ecmwf.int/...
    summary:      ERA5 is the fifth generation ECMWF atmospheric reanalysis o...
    title:        ERA5 pressure-levels oper temperature 19820101-19820131
[Wed 29 10:26:59]  End rank: 3,   Out file: /g/data/wb00/admin/testing/nci_5.625/test_test/temperature_1982_5.625.nc                      ( 322m, 55s)

┌────────────────────────────────────────────────────────────────────────────────────────────────────────────────────────┐
┊                                                Wed Mar 29 05:04:52 2023                                                ┊
┊                rank ▻ 27                                                                                               ┊
┊                node ▻ gadi-mmem-clx-0003.gadi.nci.org.au                                                               ┊
┊                year ▻ 2006                                                                                             ┊
┊              in_dir ▻ /g/data/rt52/era5/pressure-levels/reanalysis/t/2006/*                                            ┊
┊            out_file ▻ /g/data/wb00/admin/testing/nci_5.625/test_test/temperature_2006_5.625.nc                         ┊
└────────────────────────────────────────────────────────────────────────────────────────────────────────────────────────┘
<xarray.Dataset>
Dimensions:    (longitude: 1440, latitude: 721, level: 37, time: 8760)
Coordinates:
  * longitude  (longitude) float32 -180.0 -179.8 -179.5 ... 179.2 179.5 179.8
  * latitude   (latitude) float32 90.0 89.75 89.5 89.25 ... -89.5 -89.75 -90.0
  * level      (level) int32 1 2 3 5 7 10 20 30 ... 850 875 900 925 950 975 1000
  * time       (time) datetime64[ns] 2006-01-01 ... 2006-12-31T23:00:00
Data variables:
    t          (time, level, latitude, longitude) float32 dask.array<chunksize=(744, 37, 721, 1440), meta=np.ndarray>
Attributes:
    Conventions:  CF-1.6
    history:      2020-11-08 02:43:11 UTC+1100 by era5_replication_tools-1.2....
    license:      Licence to use Copernicus Products: https://apps.ecmwf.int/...
    summary:      ERA5 is the fifth generation ECMWF atmospheric reanalysis o...
    title:        ERA5 pressure-levels oper temperature 20060101-20060131
[Wed 29 07:49:32]  End rank: 27,  Out file: /g/data/wb00/admin/testing/nci_5.625/test_test/temperature_2006_5.625.nc                      ( 164m, 39s)

┌────────────────────────────────────────────────────────────────────────────────────────────────────────────────────────┐
┊                                                Wed Mar 29 05:04:54 2023                                                ┊
┊                rank ▻ 28                                                                                               ┊
┊                node ▻ gadi-mmem-clx-0003.gadi.nci.org.au                                                               ┊
┊                year ▻ 2007                                                                                             ┊
┊              in_dir ▻ /g/data/rt52/era5/pressure-levels/reanalysis/t/2007/*                                            ┊
┊            out_file ▻ /g/data/wb00/admin/testing/nci_5.625/test_test/temperature_2007_5.625.nc                         ┊
└────────────────────────────────────────────────────────────────────────────────────────────────────────────────────────┘
<xarray.Dataset>
Dimensions:    (longitude: 1440, latitude: 721, level: 37, time: 8760)
Coordinates:
  * longitude  (longitude) float32 -180.0 -179.8 -179.5 ... 179.2 179.5 179.8
  * latitude   (latitude) float32 90.0 89.75 89.5 89.25 ... -89.5 -89.75 -90.0
  * level      (level) int32 1 2 3 5 7 10 20 30 ... 850 875 900 925 950 975 1000
  * time       (time) datetime64[ns] 2007-01-01 ... 2007-12-31T23:00:00
Data variables:
    t          (time, level, latitude, longitude) float32 dask.array<chunksize=(744, 37, 721, 1440), meta=np.ndarray>
Attributes:
    Conventions:  CF-1.6
    history:      2020-10-22 21:53:16 UTC+1100 by era5_replication_tools-1.2....
    license:      Licence to use Copernicus Products: https://apps.ecmwf.int/...
    summary:      ERA5 is the fifth generation ECMWF atmospheric reanalysis o...
    title:        ERA5 pressure-levels oper temperature 20070101-20070131
[Wed 29 10:09:18]  End rank: 28,  Out file: /g/data/wb00/admin/testing/nci_5.625/test_test/temperature_2007_5.625.nc                      ( 304m, 23s)

┌────────────────────────────────────────────────────────────────────────────────────────────────────────────────────────┐
┊                                                Wed Mar 29 05:04:40 2023                                                ┊
┊                rank ▻ 21                                                                                               ┊
┊                node ▻ gadi-mmem-clx-0003.gadi.nci.org.au                                                               ┊
┊                year ▻ 2000                                                                                             ┊
┊              in_dir ▻ /g/data/rt52/era5/pressure-levels/reanalysis/t/2000/*                                            ┊
┊            out_file ▻ /g/data/wb00/admin/testing/nci_5.625/test_test/temperature_2000_5.625.nc                         ┊
└────────────────────────────────────────────────────────────────────────────────────────────────────────────────────────┘
<xarray.Dataset>
Dimensions:    (longitude: 1440, latitude: 721, level: 37, time: 8784)
Coordinates:
  * longitude  (longitude) float32 -180.0 -179.8 -179.5 ... 179.2 179.5 179.8
  * latitude   (latitude) float32 90.0 89.75 89.5 89.25 ... -89.5 -89.75 -90.0
  * level      (level) int32 1 2 3 5 7 10 20 30 ... 850 875 900 925 950 975 1000
  * time       (time) datetime64[ns] 2000-01-01 ... 2000-12-31T23:00:00
Data variables:
    t          (time, level, latitude, longitude) float32 dask.array<chunksize=(744, 37, 721, 1440), meta=np.ndarray>
Attributes:
    Conventions:  CF-1.6
    license:      Licence to use Copernicus Products: https://apps.ecmwf.int/...
    summary:      ERA5 is the fifth generation ECMWF atmospheric reanalysis o...
    title:        ERA5 pressure-levels oper temperature 20000101-20000131
    history:      2021-01-08 07:37:20 UTC+1100 by era5_replication_tools-1.8....
[Wed 29 10:02:33]  End rank: 21,  Out file: /g/data/wb00/admin/testing/nci_5.625/test_test/temperature_2000_5.625.nc                      ( 297m, 52s)

┌────────────────────────────────────────────────────────────────────────────────────────────────────────────────────────┐
┊                                                Wed Mar 29 05:04:06 2023                                                ┊
┊                rank ▻ 4                                                                                                ┊
┊                node ▻ gadi-mmem-clx-0003.gadi.nci.org.au                                                               ┊
┊                year ▻ 1983                                                                                             ┊
┊              in_dir ▻ /g/data/rt52/era5/pressure-levels/reanalysis/t/1983/*                                            ┊
┊            out_file ▻ /g/data/wb00/admin/testing/nci_5.625/test_test/temperature_1983_5.625.nc                         ┊
└────────────────────────────────────────────────────────────────────────────────────────────────────────────────────────┘
<xarray.Dataset>
Dimensions:    (longitude: 1440, latitude: 721, level: 37, time: 8760)
Coordinates:
  * longitude  (longitude) float32 -180.0 -179.8 -179.5 ... 179.2 179.5 179.8
  * latitude   (latitude) float32 90.0 89.75 89.5 89.25 ... -89.5 -89.75 -90.0
  * level      (level) int32 1 2 3 5 7 10 20 30 ... 850 875 900 925 950 975 1000
  * time       (time) datetime64[ns] 1983-01-01 ... 1983-12-31T23:00:00
Data variables:
    t          (time, level, latitude, longitude) float32 dask.array<chunksize=(744, 37, 721, 1440), meta=np.ndarray>
Attributes:
    Conventions:  CF-1.6
    history:      2020-11-04 08:37:37 UTC+1100 by era5_replication_tools-1.2....
    license:      Licence to use Copernicus Products: https://apps.ecmwf.int/...
    summary:      ERA5 is the fifth generation ECMWF atmospheric reanalysis o...
    title:        ERA5 pressure-levels oper temperature 19830101-19830131
[Wed 29 10:41:31]  End rank: 4,   Out file: /g/data/wb00/admin/testing/nci_5.625/test_test/temperature_1983_5.625.nc                      ( 337m, 24s)

┌────────────────────────────────────────────────────────────────────────────────────────────────────────────────────────┐
┊                                                Wed Mar 29 05:04:24 2023                                                ┊
┊                rank ▻ 13                                                                                               ┊
┊                node ▻ gadi-mmem-clx-0003.gadi.nci.org.au                                                               ┊
┊                year ▻ 1992                                                                                             ┊
┊              in_dir ▻ /g/data/rt52/era5/pressure-levels/reanalysis/t/1992/*                                            ┊
┊            out_file ▻ /g/data/wb00/admin/testing/nci_5.625/test_test/temperature_1992_5.625.nc                         ┊
└────────────────────────────────────────────────────────────────────────────────────────────────────────────────────────┘
<xarray.Dataset>
Dimensions:    (longitude: 1440, latitude: 721, level: 37, time: 8784)
Coordinates:
  * longitude  (longitude) float32 -180.0 -179.8 -179.5 ... 179.2 179.5 179.8
  * latitude   (latitude) float32 90.0 89.75 89.5 89.25 ... -89.5 -89.75 -90.0
  * level      (level) int32 1 2 3 5 7 10 20 30 ... 850 875 900 925 950 975 1000
  * time       (time) datetime64[ns] 1992-01-01 ... 1992-12-31T23:00:00
Data variables:
    t          (time, level, latitude, longitude) float32 dask.array<chunksize=(744, 37, 721, 1440), meta=np.ndarray>
Attributes:
    Conventions:  CF-1.6
    history:      2020-10-29 05:10:26 UTC+1100 by era5_replication_tools-1.2....
    license:      Licence to use Copernicus Products: https://apps.ecmwf.int/...
    summary:      ERA5 is the fifth generation ECMWF atmospheric reanalysis o...
    title:        ERA5 pressure-levels oper temperature 19920101-19920131
[Wed 29 09:19:24]  End rank: 13,  Out file: /g/data/wb00/admin/testing/nci_5.625/test_test/temperature_1992_5.625.nc                      ( 255m,  0s)

Done

======================================================================================
                  Resource Usage on 2023-03-29 12:35:31:
   Job Id:             78074612.gadi-pbs
   Project:            fp0
   Exit Status:        0
   Service Units:      1810.73
   NCPUs Requested:    48                     NCPUs Used: 48              
                                           CPU Time Used: 126:10:56       
   Memory Requested:   2.92TB                Memory Used: 2.68TB          
   Walltime requested: 10:00:00            Walltime Used: 07:32:41        
   JobFS requested:    400.0GB                JobFS used: 0B              
======================================================================================
