1990
1990
/g/data/wb00/admin/testing/cds_era5/single-levels/reanalysis/tp/1990
/g/data/wb00/admin/testing/cds_era5/single-levels/reanalysis/tp/1990/tp_era5_oper_sfc_19900101-19900131.nc
/g/data/wb00/admin/testing/cds_era5/single-levels/reanalysis/tp/1990/tp_era5_oper_sfc_19900201-19900228.nc
/g/data/wb00/admin/testing/cds_era5/single-levels/reanalysis/tp/1990/tp_era5_oper_sfc_19900301-19900331.nc
/g/data/wb00/admin/testing/cds_era5/single-levels/reanalysis/tp/1990/tp_era5_oper_sfc_19900401-19900430.nc
/g/data/wb00/admin/testing/cds_era5/single-levels/reanalysis/tp/1990/tp_era5_oper_sfc_19900501-19900531.nc
/g/data/wb00/admin/testing/cds_era5/single-levels/reanalysis/tp/1990/tp_era5_oper_sfc_19900601-19900630.nc
/g/data/wb00/admin/testing/cds_era5/single-levels/reanalysis/tp/1990/tp_era5_oper_sfc_19900701-19900731.nc
/g/data/wb00/admin/testing/cds_era5/single-levels/reanalysis/tp/1990/tp_era5_oper_sfc_19900801-19900831.nc
/g/data/wb00/admin/testing/cds_era5/single-levels/reanalysis/tp/1990/tp_era5_oper_sfc_19900901-19900930.nc
/g/data/wb00/admin/testing/cds_era5/single-levels/reanalysis/tp/1990/tp_era5_oper_sfc_19901001-19901031.nc
/g/data/wb00/admin/testing/cds_era5/single-levels/reanalysis/tp/1990/tp_era5_oper_sfc_19901101-19901130.nc
/g/data/wb00/admin/testing/cds_era5/single-levels/reanalysis/tp/1990/tp_era5_oper_sfc_19901201-19901231.nc

======================================================================================
                  Resource Usage on 2023-05-20 04:53:29:
   Job Id:             84297748.gadi-pbs
   Project:            fp0
   Exit Status:        0
   Service Units:      32.19
   NCPUs Requested:    1                      NCPUs Used: 1               
                                           CPU Time Used: 00:05:13        
   Memory Requested:   15.0GB                Memory Used: 3.88GB          
   Walltime requested: 10:00:00            Walltime Used: 04:17:32        
   JobFS requested:    10.0GB                 JobFS used: 0B              
======================================================================================
