
======================   ALLOCATED NODES   ======================
	gadi-cpu-clx-2521: flags=0x11 slots=48 max_slots=0 slots_inuse=0 state=UP
	gadi-cpu-clx-2522: flags=0x13 slots=48 max_slots=0 slots_inuse=0 state=UP
	gadi-cpu-clx-2523: flags=0x13 slots=48 max_slots=0 slots_inuse=0 state=UP
	gadi-cpu-clx-2524: flags=0x13 slots=48 max_slots=0 slots_inuse=0 state=UP
	gadi-cpu-clx-2525: flags=0x13 slots=48 max_slots=0 slots_inuse=0 state=UP
	gadi-cpu-clx-2526: flags=0x13 slots=48 max_slots=0 slots_inuse=0 state=UP
	gadi-cpu-clx-2527: flags=0x13 slots=48 max_slots=0 slots_inuse=0 state=UP
	gadi-cpu-clx-2528: flags=0x13 slots=48 max_slots=0 slots_inuse=0 state=UP
	gadi-cpu-clx-2529: flags=0x13 slots=48 max_slots=0 slots_inuse=0 state=UP
	gadi-cpu-clx-2530: flags=0x13 slots=48 max_slots=0 slots_inuse=0 state=UP
=================================================================
App launch reported: 10 (out of 10) daemons - 9 (out of 10) procs
rank: 24    host: gadi-cpu-clx-2527.gadi.nci.org.au
rank: 0     host: gadi-cpu-clx-2521.gadi.nci.org.au
rank: 4     host: gadi-cpu-clx-2522.gadi.nci.org.au
rank: 28    host: gadi-cpu-clx-2528.gadi.nci.org.au
rank: 8     host: gadi-cpu-clx-2523.gadi.nci.org.au
rank: 16    host: gadi-cpu-clx-2525.gadi.nci.org.au
rank: 32    host: gadi-cpu-clx-2529.gadi.nci.org.au
rank: 20    host: gadi-cpu-clx-2526.gadi.nci.org.au
rank: 12    host: gadi-cpu-clx-2524.gadi.nci.org.au
rank: 36    host: gadi-cpu-clx-2530.gadi.nci.org.au
rank: 25    host: gadi-cpu-clx-2527.gadi.nci.org.au
rank: 1     host: gadi-cpu-clx-2521.gadi.nci.org.au
rank: 5     host: gadi-cpu-clx-2522.gadi.nci.org.au
rank: 17    host: gadi-cpu-clx-2525.gadi.nci.org.au
rank: 29    host: gadi-cpu-clx-2528.gadi.nci.org.au
rank: 33    host: gadi-cpu-clx-2529.gadi.nci.org.au
rank: 13    host: gadi-cpu-clx-2524.gadi.nci.org.au
rank: 21    host: gadi-cpu-clx-2526.gadi.nci.org.au
rank: 9     host: gadi-cpu-clx-2523.gadi.nci.org.au
rank: 37    host: gadi-cpu-clx-2530.gadi.nci.org.au
rank: 26    host: gadi-cpu-clx-2527.gadi.nci.org.au
rank: 2     host: gadi-cpu-clx-2521.gadi.nci.org.au
rank: 6     host: gadi-cpu-clx-2522.gadi.nci.org.au
rank: 34    host: gadi-cpu-clx-2529.gadi.nci.org.au
rank: 30    host: gadi-cpu-clx-2528.gadi.nci.org.au
rank: 18    host: gadi-cpu-clx-2525.gadi.nci.org.au
rank: 10    host: gadi-cpu-clx-2523.gadi.nci.org.au
rank: 14    host: gadi-cpu-clx-2524.gadi.nci.org.au
rank: 22    host: gadi-cpu-clx-2526.gadi.nci.org.au
rank: 38    host: gadi-cpu-clx-2530.gadi.nci.org.au
rank: 27    host: gadi-cpu-clx-2527.gadi.nci.org.au
rank: 3     host: gadi-cpu-clx-2521.gadi.nci.org.au
rank: 7     host: gadi-cpu-clx-2522.gadi.nci.org.au
rank: 35    host: gadi-cpu-clx-2529.gadi.nci.org.au
rank: 19    host: gadi-cpu-clx-2525.gadi.nci.org.au
rank: 31    host: gadi-cpu-clx-2528.gadi.nci.org.au
rank: 23    host: gadi-cpu-clx-2526.gadi.nci.org.au
rank: 15    host: gadi-cpu-clx-2524.gadi.nci.org.au
rank: 11    host: gadi-cpu-clx-2523.gadi.nci.org.au
rank: 39    host: gadi-cpu-clx-2530.gadi.nci.org.au
╔════════════════════════════════════════════════════════════════════════════════════════════════════════════════════════╗
║ ╔════════════════════════════════════════════════════════════════════════════════════════════════════════════════════╗ ║
║ ║                                                    Common Param                                                    ║ ║
║ ║           ERA_param ▶ 2t                                                                                           ║ ║
║ ║    config_file_path ▶ /scratch/fp0/mah900/WeatherBench/pbs_scripts/config_2m_temperature.yml                       ║ ║
║ ║             out_deg ▶ 5.625000                                                                                     ║ ║
║ ║           algorithm ▶ bilinear                                                                                     ║ ║
║ ║      pressure_level ▶ None                                                                                         ║ ║
║ ║       in_dir_prefix ▶ /g/data/rt52/era5/single-levels/reanalysis/2t                                                ║ ║
║ ║     out_file_prefix ▶ /g/data/wb00/admin/testing/weatherbench/5.625deg/2m_temperature/2m_temperature               ║ ║
║ ╚════════════════════════════════════════════════════════════════════════════════════════════════════════════════════╝ ║
╚════════════════════════════════════════════════════════════════════════════════════════════════════════════════════════╝


┌────────────────────────────────────────────────────────────────────────────────────────────────────────────────────────┐
┊                                                Mon Mar 20 01:04:58 2023                                                ┊
┊                rank ▻ 0                                                                                                ┊
┊                node ▻ gadi-cpu-clx-2521.gadi.nci.org.au                                                                ┊
┊                year ▻ 1979                                                                                             ┊
┊              in_dir ▻ /g/data/rt52/era5/single-levels/reanalysis/2t/1979/*                                             ┊
┊            out_file ▻ /g/data/wb00/admin/testing/weatherbench/5.625deg/2m_temperature/2m_temperature_1979_5.625.nc     ┊
└────────────────────────────────────────────────────────────────────────────────────────────────────────────────────────┘
<xarray.Dataset>
Dimensions:    (longitude: 1440, latitude: 721, time: 8760)
Coordinates:
  * longitude  (longitude) float32 -180.0 -179.8 -179.5 ... 179.2 179.5 179.8
  * latitude   (latitude) float32 90.0 89.75 89.5 89.25 ... -89.5 -89.75 -90.0
  * time       (time) datetime64[ns] 1979-01-01 ... 1979-12-31T23:00:00
Data variables:
    t2m        (time, latitude, longitude) float32 dask.array<chunksize=(4, 721, 1440), meta=np.ndarray>
Attributes:
    Conventions:  CF-1.6
    history:      2020-10-04 20:19:05 UTC+1100 by era5_replication_tools-1.2....
    license:      Licence to use Copernicus Products: https://apps.ecmwf.int/...
    summary:      ERA5 is the fifth generation ECMWF atmospheric reanalysis o...
    title:        ERA5 single-levels reanalysis 2m_temperature 19790101-19790131
━━━━━━━━━━━━━━━━━━━━━━━━━━━━━━━━━━━━━━━━━━━━━━━━━━━━━━━━━━━━━━━━━━━━━━━━━━━━━━━━━━━━━━━━━━━━━━━━━━━━━━━━━━━━━━━━━━━━━━━━━━


┌────────────────────────────────────────────────────────────────────────────────────────────────────────────────────────┐
┊                                                Mon Mar 20 01:05:03 2023                                                ┊
┊                rank ▻ 1                                                                                                ┊
┊                node ▻ gadi-cpu-clx-2521.gadi.nci.org.au                                                                ┊
┊                year ▻ 1980                                                                                             ┊
┊              in_dir ▻ /g/data/rt52/era5/single-levels/reanalysis/2t/1980/*                                             ┊
┊            out_file ▻ /g/data/wb00/admin/testing/weatherbench/5.625deg/2m_temperature/2m_temperature_1980_5.625.nc     ┊
└────────────────────────────────────────────────────────────────────────────────────────────────────────────────────────┘
┌────────────────────────────────────────────────────────────────────────────────────────────────────────────────────────┐
┊                                                Mon Mar 20 01:05:05 2023                                                ┊
┊                rank ▻ 2                                                                                                ┊
┊                node ▻ gadi-cpu-clx-2521.gadi.nci.org.au                                                                ┊
┊                year ▻ 1981                                                                                             ┊
┊              in_dir ▻ /g/data/rt52/era5/single-levels/reanalysis/2t/1981/*                                             ┊
┊            out_file ▻ /g/data/wb00/admin/testing/weatherbench/5.625deg/2m_temperature/2m_temperature_1981_5.625.nc     ┊
└────────────────────────────────────────────────────────────────────────────────────────────────────────────────────────┘
<xarray.Dataset>
Dimensions:    (longitude: 1440, latitude: 721, time: 8760)
Coordinates:
  * longitude  (longitude) float32 -180.0 -179.8 -179.5 ... 179.2 179.5 179.8
  * latitude   (latitude) float32 90.0 89.75 89.5 89.25 ... -89.5 -89.75 -90.0
  * time       (time) datetime64[ns] 1981-01-01 ... 1981-12-31T23:00:00
Data variables:
    t2m        (time, latitude, longitude) float32 dask.array<chunksize=(4, 721, 1440), meta=np.ndarray>
Attributes:
    Conventions:  CF-1.6
    history:      2020-10-04 12:05:09 UTC+1100 by era5_replication_tools-1.2....
    license:      Licence to use Copernicus Products: https://apps.ecmwf.int/...
    summary:      ERA5 is the fifth generation ECMWF atmospheric reanalysis o...
    title:        ERA5 single-levels reanalysis 2m_temperature 19810101-19810131
━━━━━━━━━━━━━━━━━━━━━━━━━━━━━━━━━━━━━━━━━━━━━━━━━━━━━━━━━━━━━━━━━━━━━━━━━━━━━━━━━━━━━━━━━━━━━━━━━━━━━━━━━━━━━━━━━━━━━━━━━━


┌────────────────────────────────────────────────────────────────────────────────────────────────────────────────────────┐
┊                                                Mon Mar 20 01:05:07 2023                                                ┊
┊                rank ▻ 3                                                                                                ┊
┊                node ▻ gadi-cpu-clx-2521.gadi.nci.org.au                                                                ┊
┊                year ▻ 1982                                                                                             ┊
┊              in_dir ▻ /g/data/rt52/era5/single-levels/reanalysis/2t/1982/*                                             ┊
┊            out_file ▻ /g/data/wb00/admin/testing/weatherbench/5.625deg/2m_temperature/2m_temperature_1982_5.625.nc     ┊
└────────────────────────────────────────────────────────────────────────────────────────────────────────────────────────┘
<xarray.Dataset>
Dimensions:    (longitude: 1440, latitude: 721, time: 8760)
Coordinates:
  * longitude  (longitude) float32 -180.0 -179.8 -179.5 ... 179.2 179.5 179.8
  * latitude   (latitude) float32 90.0 89.75 89.5 89.25 ... -89.5 -89.75 -90.0
  * time       (time) datetime64[ns] 1982-01-01 ... 1982-12-31T23:00:00
Data variables:
    t2m        (time, latitude, longitude) float32 dask.array<chunksize=(4, 721, 1440), meta=np.ndarray>
Attributes:
    Conventions:  CF-1.6
    history:      2020-10-04 08:09:36 UTC+1100 by era5_replication_tools-1.2....
    license:      Licence to use Copernicus Products: https://apps.ecmwf.int/...
    summary:      ERA5 is the fifth generation ECMWF atmospheric reanalysis o...
    title:        ERA5 single-levels reanalysis 2m_temperature 19820101-19820131
━━━━━━━━━━━━━━━━━━━━━━━━━━━━━━━━━━━━━━━━━━━━━━━━━━━━━━━━━━━━━━━━━━━━━━━━━━━━━━━━━━━━━━━━━━━━━━━━━━━━━━━━━━━━━━━━━━━━━━━━━━


<xarray.Dataset>
Dimensions:    (longitude: 1440, latitude: 721, time: 8784)
Coordinates:
  * longitude  (longitude) float32 -180.0 -179.8 -179.5 ... 179.2 179.5 179.8
  * latitude   (latitude) float32 90.0 89.75 89.5 89.25 ... -89.5 -89.75 -90.0
  * time       (time) datetime64[ns] 1980-01-01 ... 1980-12-31T23:00:00
Data variables:
    t2m        (time, latitude, longitude) float32 dask.array<chunksize=(4, 721, 1440), meta=np.ndarray>
Attributes:
    Conventions:  CF-1.6
    history:      2020-10-04 15:35:20 UTC+1100 by era5_replication_tools-1.2....
    license:      Licence to use Copernicus Products: https://apps.ecmwf.int/...
    summary:      ERA5 is the fifth generation ECMWF atmospheric reanalysis o...
    title:        ERA5 single-levels reanalysis 2m_temperature 19800101-19800131
━━━━━━━━━━━━━━━━━━━━━━━━━━━━━━━━━━━━━━━━━━━━━━━━━━━━━━━━━━━━━━━━━━━━━━━━━━━━━━━━━━━━━━━━━━━━━━━━━━━━━━━━━━━━━━━━━━━━━━━━━━


┌────────────────────────────────────────────────────────────────────────────────────────────────────────────────────────┐
┊                                                Mon Mar 20 01:05:09 2023                                                ┊
┊                rank ▻ 4                                                                                                ┊
┊                node ▻ gadi-cpu-clx-2522.gadi.nci.org.au                                                                ┊
┊                year ▻ 1983                                                                                             ┊
┊              in_dir ▻ /g/data/rt52/era5/single-levels/reanalysis/2t/1983/*                                             ┊
┊            out_file ▻ /g/data/wb00/admin/testing/weatherbench/5.625deg/2m_temperature/2m_temperature_1983_5.625.nc     ┊
└────────────────────────────────────────────────────────────────────────────────────────────────────────────────────────┘
<xarray.Dataset>
Dimensions:    (longitude: 1440, latitude: 721, time: 8760)
Coordinates:
  * longitude  (longitude) float32 -180.0 -179.8 -179.5 ... 179.2 179.5 179.8
  * latitude   (latitude) float32 90.0 89.75 89.5 89.25 ... -89.5 -89.75 -90.0
  * time       (time) datetime64[ns] 1983-01-01 ... 1983-12-31T23:00:00
Data variables:
    t2m        (time, latitude, longitude) float32 dask.array<chunksize=(4, 721, 1440), meta=np.ndarray>
Attributes:
    Conventions:  CF-1.6
    history:      2020-10-04 03:15:10 UTC+1100 by era5_replication_tools-1.2....
    license:      Licence to use Copernicus Products: https://apps.ecmwf.int/...
    summary:      ERA5 is the fifth generation ECMWF atmospheric reanalysis o...
    title:        ERA5 single-levels reanalysis 2m_temperature 19830101-19830131
━━━━━━━━━━━━━━━━━━━━━━━━━━━━━━━━━━━━━━━━━━━━━━━━━━━━━━━━━━━━━━━━━━━━━━━━━━━━━━━━━━━━━━━━━━━━━━━━━━━━━━━━━━━━━━━━━━━━━━━━━━


┌────────────────────────────────────────────────────────────────────────────────────────────────────────────────────────┐
┊                                                Mon Mar 20 01:05:11 2023                                                ┊
┊                rank ▻ 5                                                                                                ┊
┊                node ▻ gadi-cpu-clx-2522.gadi.nci.org.au                                                                ┊
┊                year ▻ 1984                                                                                             ┊
┊              in_dir ▻ /g/data/rt52/era5/single-levels/reanalysis/2t/1984/*                                             ┊
┊            out_file ▻ /g/data/wb00/admin/testing/weatherbench/5.625deg/2m_temperature/2m_temperature_1984_5.625.nc     ┊
└────────────────────────────────────────────────────────────────────────────────────────────────────────────────────────┘
<xarray.Dataset>
Dimensions:    (longitude: 1440, latitude: 721, time: 8784)
Coordinates:
  * longitude  (longitude) float32 -180.0 -179.8 -179.5 ... 179.2 179.5 179.8
  * latitude   (latitude) float32 90.0 89.75 89.5 89.25 ... -89.5 -89.75 -90.0
  * time       (time) datetime64[ns] 1984-01-01 ... 1984-12-31T23:00:00
Data variables:
    t2m        (time, latitude, longitude) float32 dask.array<chunksize=(4, 721, 1440), meta=np.ndarray>
Attributes:
    Conventions:  CF-1.6
    history:      2020-10-03 22:35:49 UTC+1000 by era5_replication_tools-1.2....
    license:      Licence to use Copernicus Products: https://apps.ecmwf.int/...
    summary:      ERA5 is the fifth generation ECMWF atmospheric reanalysis o...
    title:        ERA5 single-levels reanalysis 2m_temperature 19840101-19840131
━━━━━━━━━━━━━━━━━━━━━━━━━━━━━━━━━━━━━━━━━━━━━━━━━━━━━━━━━━━━━━━━━━━━━━━━━━━━━━━━━━━━━━━━━━━━━━━━━━━━━━━━━━━━━━━━━━━━━━━━━━


┌────────────────────────────────────────────────────────────────────────────────────────────────────────────────────────┐
┊                                                Mon Mar 20 01:05:13 2023                                                ┊
┊                rank ▻ 6                                                                                                ┊
┊                node ▻ gadi-cpu-clx-2522.gadi.nci.org.au                                                                ┊
┊                year ▻ 1985                                                                                             ┊
┊              in_dir ▻ /g/data/rt52/era5/single-levels/reanalysis/2t/1985/*                                             ┊
┊            out_file ▻ /g/data/wb00/admin/testing/weatherbench/5.625deg/2m_temperature/2m_temperature_1985_5.625.nc     ┊
└────────────────────────────────────────────────────────────────────────────────────────────────────────────────────────┘
<xarray.Dataset>
Dimensions:    (longitude: 1440, latitude: 721, time: 8760)
Coordinates:
  * longitude  (longitude) float32 -180.0 -179.8 -179.5 ... 179.2 179.5 179.8
  * latitude   (latitude) float32 90.0 89.75 89.5 89.25 ... -89.5 -89.75 -90.0
  * time       (time) datetime64[ns] 1985-01-01 ... 1985-12-31T23:00:00
Data variables:
    t2m        (time, latitude, longitude) float32 dask.array<chunksize=(4, 721, 1440), meta=np.ndarray>
Attributes:
    Conventions:  CF-1.6
    history:      2020-10-03 18:18:19 UTC+1000 by era5_replication_tools-1.2....
    license:      Licence to use Copernicus Products: https://apps.ecmwf.int/...
    summary:      ERA5 is the fifth generation ECMWF atmospheric reanalysis o...
    title:        ERA5 single-levels reanalysis 2m_temperature 19850101-19850131
━━━━━━━━━━━━━━━━━━━━━━━━━━━━━━━━━━━━━━━━━━━━━━━━━━━━━━━━━━━━━━━━━━━━━━━━━━━━━━━━━━━━━━━━━━━━━━━━━━━━━━━━━━━━━━━━━━━━━━━━━━


┌────────────────────────────────────────────────────────────────────────────────────────────────────────────────────────┐
┊                                                Mon Mar 20 01:05:15 2023                                                ┊
┊                rank ▻ 7                                                                                                ┊
┊                node ▻ gadi-cpu-clx-2522.gadi.nci.org.au                                                                ┊
┊                year ▻ 1986                                                                                             ┊
┊              in_dir ▻ /g/data/rt52/era5/single-levels/reanalysis/2t/1986/*                                             ┊
┊            out_file ▻ /g/data/wb00/admin/testing/weatherbench/5.625deg/2m_temperature/2m_temperature_1986_5.625.nc     ┊
└────────────────────────────────────────────────────────────────────────────────────────────────────────────────────────┘
<xarray.Dataset>
Dimensions:    (longitude: 1440, latitude: 721, time: 8760)
Coordinates:
  * longitude  (longitude) float32 -180.0 -179.8 -179.5 ... 179.2 179.5 179.8
  * latitude   (latitude) float32 90.0 89.75 89.5 89.25 ... -89.5 -89.75 -90.0
  * time       (time) datetime64[ns] 1986-01-01 ... 1986-12-31T23:00:00
Data variables:
    t2m        (time, latitude, longitude) float32 dask.array<chunksize=(4, 721, 1440), meta=np.ndarray>
Attributes:
    Conventions:  CF-1.6
    history:      2020-10-03 13:19:15 UTC+1000 by era5_replication_tools-1.2....
    license:      Licence to use Copernicus Products: https://apps.ecmwf.int/...
    summary:      ERA5 is the fifth generation ECMWF atmospheric reanalysis o...
    title:        ERA5 single-levels reanalysis 2m_temperature 19860101-19860131
━━━━━━━━━━━━━━━━━━━━━━━━━━━━━━━━━━━━━━━━━━━━━━━━━━━━━━━━━━━━━━━━━━━━━━━━━━━━━━━━━━━━━━━━━━━━━━━━━━━━━━━━━━━━━━━━━━━━━━━━━━


┌────────────────────────────────────────────────────────────────────────────────────────────────────────────────────────┐
┊                                                Mon Mar 20 01:05:17 2023                                                ┊
┊                rank ▻ 8                                                                                                ┊
┊                node ▻ gadi-cpu-clx-2523.gadi.nci.org.au                                                                ┊
┊                year ▻ 1987                                                                                             ┊
┊              in_dir ▻ /g/data/rt52/era5/single-levels/reanalysis/2t/1987/*                                             ┊
┊            out_file ▻ /g/data/wb00/admin/testing/weatherbench/5.625deg/2m_temperature/2m_temperature_1987_5.625.nc     ┊
└────────────────────────────────────────────────────────────────────────────────────────────────────────────────────────┘
<xarray.Dataset>
Dimensions:    (longitude: 1440, latitude: 721, time: 8760)
Coordinates:
  * longitude  (longitude) float32 -180.0 -179.8 -179.5 ... 179.2 179.5 179.8
  * latitude   (latitude) float32 90.0 89.75 89.5 89.25 ... -89.5 -89.75 -90.0
  * time       (time) datetime64[ns] 1987-01-01 ... 1987-12-31T23:00:00
Data variables:
    t2m        (time, latitude, longitude) float32 dask.array<chunksize=(4, 721, 1440), meta=np.ndarray>
Attributes:
    Conventions:  CF-1.6
    history:      2020-10-03 08:45:42 UTC+1000 by era5_replication_tools-1.2....
    license:      Licence to use Copernicus Products: https://apps.ecmwf.int/...
    summary:      ERA5 is the fifth generation ECMWF atmospheric reanalysis o...
    title:        ERA5 single-levels reanalysis 2m_temperature 19870101-19870131
━━━━━━━━━━━━━━━━━━━━━━━━━━━━━━━━━━━━━━━━━━━━━━━━━━━━━━━━━━━━━━━━━━━━━━━━━━━━━━━━━━━━━━━━━━━━━━━━━━━━━━━━━━━━━━━━━━━━━━━━━━


┌────────────────────────────────────────────────────────────────────────────────────────────────────────────────────────┐
┊                                                Mon Mar 20 01:05:19 2023                                                ┊
┊                rank ▻ 9                                                                                                ┊
┊                node ▻ gadi-cpu-clx-2523.gadi.nci.org.au                                                                ┊
┊                year ▻ 1988                                                                                             ┊
┊              in_dir ▻ /g/data/rt52/era5/single-levels/reanalysis/2t/1988/*                                             ┊
┊            out_file ▻ /g/data/wb00/admin/testing/weatherbench/5.625deg/2m_temperature/2m_temperature_1988_5.625.nc     ┊
└────────────────────────────────────────────────────────────────────────────────────────────────────────────────────────┘
<xarray.Dataset>
Dimensions:    (longitude: 1440, latitude: 721, time: 8784)
Coordinates:
  * longitude  (longitude) float32 -180.0 -179.8 -179.5 ... 179.2 179.5 179.8
  * latitude   (latitude) float32 90.0 89.75 89.5 89.25 ... -89.5 -89.75 -90.0
  * time       (time) datetime64[ns] 1988-01-01 ... 1988-12-31T23:00:00
Data variables:
    t2m        (time, latitude, longitude) float32 dask.array<chunksize=(4, 721, 1440), meta=np.ndarray>
Attributes:
    Conventions:  CF-1.6
    history:      2020-10-03 03:37:45 UTC+1000 by era5_replication_tools-1.2....
    license:      Licence to use Copernicus Products: https://apps.ecmwf.int/...
    summary:      ERA5 is the fifth generation ECMWF atmospheric reanalysis o...
    title:        ERA5 single-levels reanalysis 2m_temperature 19880101-19880131
━━━━━━━━━━━━━━━━━━━━━━━━━━━━━━━━━━━━━━━━━━━━━━━━━━━━━━━━━━━━━━━━━━━━━━━━━━━━━━━━━━━━━━━━━━━━━━━━━━━━━━━━━━━━━━━━━━━━━━━━━━


┌────────────────────────────────────────────────────────────────────────────────────────────────────────────────────────┐
┊                                                Mon Mar 20 01:05:21 2023                                                ┊
┊                rank ▻ 10                                                                                               ┊
┊                node ▻ gadi-cpu-clx-2523.gadi.nci.org.au                                                                ┊
┊                year ▻ 1989                                                                                             ┊
┊              in_dir ▻ /g/data/rt52/era5/single-levels/reanalysis/2t/1989/*                                             ┊
┊            out_file ▻ /g/data/wb00/admin/testing/weatherbench/5.625deg/2m_temperature/2m_temperature_1989_5.625.nc     ┊
└────────────────────────────────────────────────────────────────────────────────────────────────────────────────────────┘
┌────────────────────────────────────────────────────────────────────────────────────────────────────────────────────────┐
┊                                                Mon Mar 20 01:05:23 2023                                                ┊
┊                rank ▻ 11                                                                                               ┊
┊                node ▻ gadi-cpu-clx-2523.gadi.nci.org.au                                                                ┊
┊                year ▻ 1990                                                                                             ┊
┊              in_dir ▻ /g/data/rt52/era5/single-levels/reanalysis/2t/1990/*                                             ┊
┊            out_file ▻ /g/data/wb00/admin/testing/weatherbench/5.625deg/2m_temperature/2m_temperature_1990_5.625.nc     ┊
└────────────────────────────────────────────────────────────────────────────────────────────────────────────────────────┘
<xarray.Dataset>
Dimensions:    (longitude: 1440, latitude: 721, time: 8760)
Coordinates:
  * longitude  (longitude) float32 -180.0 -179.8 -179.5 ... 179.2 179.5 179.8
  * latitude   (latitude) float32 90.0 89.75 89.5 89.25 ... -89.5 -89.75 -90.0
  * time       (time) datetime64[ns] 1989-01-01 ... 1989-12-31T23:00:00
Data variables:
    t2m        (time, latitude, longitude) float32 dask.array<chunksize=(4, 721, 1440), meta=np.ndarray>
Attributes:
    Conventions:  CF-1.6
    history:      2020-10-02 23:37:51 UTC+1000 by era5_replication_tools-1.2....
    license:      Licence to use Copernicus Products: https://apps.ecmwf.int/...
    summary:      ERA5 is the fifth generation ECMWF atmospheric reanalysis o...
    title:        ERA5 single-levels reanalysis 2m_temperature 19890101-19890131
━━━━━━━━━━━━━━━━━━━━━━━━━━━━━━━━━━━━━━━━━━━━━━━━━━━━━━━━━━━━━━━━━━━━━━━━━━━━━━━━━━━━━━━━━━━━━━━━━━━━━━━━━━━━━━━━━━━━━━━━━━


┌────────────────────────────────────────────────────────────────────────────────────────────────────────────────────────┐
┊                                                Mon Mar 20 01:05:25 2023                                                ┊
┊                rank ▻ 12                                                                                               ┊
┊                node ▻ gadi-cpu-clx-2524.gadi.nci.org.au                                                                ┊
┊                year ▻ 1991                                                                                             ┊
┊              in_dir ▻ /g/data/rt52/era5/single-levels/reanalysis/2t/1991/*                                             ┊
┊            out_file ▻ /g/data/wb00/admin/testing/weatherbench/5.625deg/2m_temperature/2m_temperature_1991_5.625.nc     ┊
└────────────────────────────────────────────────────────────────────────────────────────────────────────────────────────┘
<xarray.Dataset>
Dimensions:    (longitude: 1440, latitude: 721, time: 8760)
Coordinates:
  * longitude  (longitude) float32 -180.0 -179.8 -179.5 ... 179.2 179.5 179.8
  * latitude   (latitude) float32 90.0 89.75 89.5 89.25 ... -89.5 -89.75 -90.0
  * time       (time) datetime64[ns] 1991-01-01 ... 1991-12-31T23:00:00
Data variables:
    t2m        (time, latitude, longitude) float32 dask.array<chunksize=(4, 721, 1440), meta=np.ndarray>
Attributes:
    Conventions:  CF-1.6
    history:      2020-10-02 13:51:30 UTC+1000 by era5_replication_tools-1.2....
    license:      Licence to use Copernicus Products: https://apps.ecmwf.int/...
    summary:      ERA5 is the fifth generation ECMWF atmospheric reanalysis o...
    title:        ERA5 single-levels reanalysis 2m_temperature 19910101-19910131
━━━━━━━━━━━━━━━━━━━━━━━━━━━━━━━━━━━━━━━━━━━━━━━━━━━━━━━━━━━━━━━━━━━━━━━━━━━━━━━━━━━━━━━━━━━━━━━━━━━━━━━━━━━━━━━━━━━━━━━━━━


┌────────────────────────────────────────────────────────────────────────────────────────────────────────────────────────┐
┊                                                Mon Mar 20 01:05:27 2023                                                ┊
┊                rank ▻ 13                                                                                               ┊
┊                node ▻ gadi-cpu-clx-2524.gadi.nci.org.au                                                                ┊
┊                year ▻ 1992                                                                                             ┊
┊              in_dir ▻ /g/data/rt52/era5/single-levels/reanalysis/2t/1992/*                                             ┊
┊            out_file ▻ /g/data/wb00/admin/testing/weatherbench/5.625deg/2m_temperature/2m_temperature_1992_5.625.nc     ┊
└────────────────────────────────────────────────────────────────────────────────────────────────────────────────────────┘
<xarray.Dataset>
Dimensions:    (longitude: 1440, latitude: 721, time: 8760)
Coordinates:
  * longitude  (longitude) float32 -180.0 -179.8 -179.5 ... 179.2 179.5 179.8
  * latitude   (latitude) float32 90.0 89.75 89.5 89.25 ... -89.5 -89.75 -90.0
  * time       (time) datetime64[ns] 1990-01-01 ... 1990-12-31T23:00:00
Data variables:
    t2m        (time, latitude, longitude) float32 dask.array<chunksize=(4, 721, 1440), meta=np.ndarray>
Attributes:
    Conventions:  CF-1.6
    history:      2020-10-02 19:02:16 UTC+1000 by era5_replication_tools-1.2....
    license:      Licence to use Copernicus Products: https://apps.ecmwf.int/...
    summary:      ERA5 is the fifth generation ECMWF atmospheric reanalysis o...
    title:        ERA5 single-levels reanalysis 2m_temperature 19900101-19900131
━━━━━━━━━━━━━━━━━━━━━━━━━━━━━━━━━━━━━━━━━━━━━━━━━━━━━━━━━━━━━━━━━━━━━━━━━━━━━━━━━━━━━━━━━━━━━━━━━━━━━━━━━━━━━━━━━━━━━━━━━━


┌────────────────────────────────────────────────────────────────────────────────────────────────────────────────────────┐
┊                                                Mon Mar 20 01:05:29 2023                                                ┊
┊                rank ▻ 14                                                                                               ┊
┊                node ▻ gadi-cpu-clx-2524.gadi.nci.org.au                                                                ┊
┊                year ▻ 1993                                                                                             ┊
┊              in_dir ▻ /g/data/rt52/era5/single-levels/reanalysis/2t/1993/*                                             ┊
┊            out_file ▻ /g/data/wb00/admin/testing/weatherbench/5.625deg/2m_temperature/2m_temperature_1993_5.625.nc     ┊
└────────────────────────────────────────────────────────────────────────────────────────────────────────────────────────┘
<xarray.Dataset>
Dimensions:    (longitude: 1440, latitude: 721, time: 8784)
Coordinates:
  * longitude  (longitude) float32 -180.0 -179.8 -179.5 ... 179.2 179.5 179.8
  * latitude   (latitude) float32 90.0 89.75 89.5 89.25 ... -89.5 -89.75 -90.0
  * time       (time) datetime64[ns] 1992-01-01 ... 1992-12-31T23:00:00
Data variables:
    t2m        (time, latitude, longitude) float32 dask.array<chunksize=(4, 721, 1440), meta=np.ndarray>
Attributes:
    Conventions:  CF-1.6
    history:      2020-10-02 09:44:08 UTC+1000 by era5_replication_tools-1.2....
    license:      Licence to use Copernicus Products: https://apps.ecmwf.int/...
    summary:      ERA5 is the fifth generation ECMWF atmospheric reanalysis o...
    title:        ERA5 single-levels reanalysis 2m_temperature 19920101-19920131
━━━━━━━━━━━━━━━━━━━━━━━━━━━━━━━━━━━━━━━━━━━━━━━━━━━━━━━━━━━━━━━━━━━━━━━━━━━━━━━━━━━━━━━━━━━━━━━━━━━━━━━━━━━━━━━━━━━━━━━━━━


<xarray.Dataset>
Dimensions:    (longitude: 1440, latitude: 721, time: 8760)
Coordinates:
  * longitude  (longitude) float32 -180.0 -179.8 -179.5 ... 179.2 179.5 179.8
  * latitude   (latitude) float32 90.0 89.75 89.5 89.25 ... -89.5 -89.75 -90.0
  * time       (time) datetime64[ns] 1993-01-01 ... 1993-12-31T23:00:00
Data variables:
    t2m        (time, latitude, longitude) float32 dask.array<chunksize=(4, 721, 1440), meta=np.ndarray>
Attributes:
    Conventions:  CF-1.6
    history:      2020-10-02 04:49:10 UTC+1000 by era5_replication_tools-1.2....
    license:      Licence to use Copernicus Products: https://apps.ecmwf.int/...
    summary:      ERA5 is the fifth generation ECMWF atmospheric reanalysis o...
    title:        ERA5 single-levels reanalysis 2m_temperature 19930101-19930131
━━━━━━━━━━━━━━━━━━━━━━━━━━━━━━━━━━━━━━━━━━━━━━━━━━━━━━━━━━━━━━━━━━━━━━━━━━━━━━━━━━━━━━━━━━━━━━━━━━━━━━━━━━━━━━━━━━━━━━━━━━


┌────────────────────────────────────────────────────────────────────────────────────────────────────────────────────────┐
┊                                                Mon Mar 20 01:05:31 2023                                                ┊
┊                rank ▻ 15                                                                                               ┊
┊                node ▻ gadi-cpu-clx-2524.gadi.nci.org.au                                                                ┊
┊                year ▻ 1994                                                                                             ┊
┊              in_dir ▻ /g/data/rt52/era5/single-levels/reanalysis/2t/1994/*                                             ┊
┊            out_file ▻ /g/data/wb00/admin/testing/weatherbench/5.625deg/2m_temperature/2m_temperature_1994_5.625.nc     ┊
└────────────────────────────────────────────────────────────────────────────────────────────────────────────────────────┘
┌────────────────────────────────────────────────────────────────────────────────────────────────────────────────────────┐
┊                                                Mon Mar 20 01:05:33 2023                                                ┊
┊                rank ▻ 16                                                                                               ┊
┊                node ▻ gadi-cpu-clx-2525.gadi.nci.org.au                                                                ┊
┊                year ▻ 1995                                                                                             ┊
┊              in_dir ▻ /g/data/rt52/era5/single-levels/reanalysis/2t/1995/*                                             ┊
┊            out_file ▻ /g/data/wb00/admin/testing/weatherbench/5.625deg/2m_temperature/2m_temperature_1995_5.625.nc     ┊
└────────────────────────────────────────────────────────────────────────────────────────────────────────────────────────┘
<xarray.Dataset>
Dimensions:    (longitude: 1440, latitude: 721, time: 8760)
Coordinates:
  * longitude  (longitude) float32 -180.0 -179.8 -179.5 ... 179.2 179.5 179.8
  * latitude   (latitude) float32 90.0 89.75 89.5 89.25 ... -89.5 -89.75 -90.0
  * time       (time) datetime64[ns] 1994-01-01 ... 1994-12-31T23:00:00
Data variables:
    t2m        (time, latitude, longitude) float32 dask.array<chunksize=(4, 721, 1440), meta=np.ndarray>
Attributes:
    Conventions:  CF-1.6
    history:      2020-10-02 00:28:51 UTC+1000 by era5_replication_tools-1.2....
    license:      Licence to use Copernicus Products: https://apps.ecmwf.int/...
    summary:      ERA5 is the fifth generation ECMWF atmospheric reanalysis o...
    title:        ERA5 single-levels reanalysis 2m_temperature 19940101-19940131
━━━━━━━━━━━━━━━━━━━━━━━━━━━━━━━━━━━━━━━━━━━━━━━━━━━━━━━━━━━━━━━━━━━━━━━━━━━━━━━━━━━━━━━━━━━━━━━━━━━━━━━━━━━━━━━━━━━━━━━━━━


<xarray.Dataset>
Dimensions:    (longitude: 1440, latitude: 721, time: 8760)
Coordinates:
  * longitude  (longitude) float32 -180.0 -179.8 -179.5 ... 179.2 179.5 179.8
  * latitude   (latitude) float32 90.0 89.75 89.5 89.25 ... -89.5 -89.75 -90.0
  * time       (time) datetime64[ns] 1995-01-01 ... 1995-12-31T23:00:00
Data variables:
    t2m        (time, latitude, longitude) float32 dask.array<chunksize=(4, 721, 1440), meta=np.ndarray>
Attributes:
    Conventions:  CF-1.6
    history:      2020-10-01 20:15:22 UTC+1000 by era5_replication_tools-1.2....
    license:      Licence to use Copernicus Products: https://apps.ecmwf.int/...
    summary:      ERA5 is the fifth generation ECMWF atmospheric reanalysis o...
    title:        ERA5 single-levels reanalysis 2m_temperature 19950101-19950131
━━━━━━━━━━━━━━━━━━━━━━━━━━━━━━━━━━━━━━━━━━━━━━━━━━━━━━━━━━━━━━━━━━━━━━━━━━━━━━━━━━━━━━━━━━━━━━━━━━━━━━━━━━━━━━━━━━━━━━━━━━


┌────────────────────────────────────────────────────────────────────────────────────────────────────────────────────────┐
┊                                                Mon Mar 20 01:05:35 2023                                                ┊
┊                rank ▻ 17                                                                                               ┊
┊                node ▻ gadi-cpu-clx-2525.gadi.nci.org.au                                                                ┊
┊                year ▻ 1996                                                                                             ┊
┊              in_dir ▻ /g/data/rt52/era5/single-levels/reanalysis/2t/1996/*                                             ┊
┊            out_file ▻ /g/data/wb00/admin/testing/weatherbench/5.625deg/2m_temperature/2m_temperature_1996_5.625.nc     ┊
└────────────────────────────────────────────────────────────────────────────────────────────────────────────────────────┘
<xarray.Dataset>
Dimensions:    (longitude: 1440, latitude: 721, time: 8784)
Coordinates:
  * longitude  (longitude) float32 -180.0 -179.8 -179.5 ... 179.2 179.5 179.8
  * latitude   (latitude) float32 90.0 89.75 89.5 89.25 ... -89.5 -89.75 -90.0
  * time       (time) datetime64[ns] 1996-01-01 ... 1996-12-31T23:00:00
Data variables:
    t2m        (time, latitude, longitude) float32 dask.array<chunksize=(4, 721, 1440), meta=np.ndarray>
Attributes:
    Conventions:  CF-1.6
    history:      2020-10-01 14:59:47 UTC+1000 by era5_replication_tools-1.2....
    license:      Licence to use Copernicus Products: https://apps.ecmwf.int/...
    summary:      ERA5 is the fifth generation ECMWF atmospheric reanalysis o...
    title:        ERA5 single-levels reanalysis 2m_temperature 19960101-19960131
━━━━━━━━━━━━━━━━━━━━━━━━━━━━━━━━━━━━━━━━━━━━━━━━━━━━━━━━━━━━━━━━━━━━━━━━━━━━━━━━━━━━━━━━━━━━━━━━━━━━━━━━━━━━━━━━━━━━━━━━━━


┌────────────────────────────────────────────────────────────────────────────────────────────────────────────────────────┐
┊                                                Mon Mar 20 01:05:37 2023                                                ┊
┊                rank ▻ 18                                                                                               ┊
┊                node ▻ gadi-cpu-clx-2525.gadi.nci.org.au                                                                ┊
┊                year ▻ 1997                                                                                             ┊
┊              in_dir ▻ /g/data/rt52/era5/single-levels/reanalysis/2t/1997/*                                             ┊
┊            out_file ▻ /g/data/wb00/admin/testing/weatherbench/5.625deg/2m_temperature/2m_temperature_1997_5.625.nc     ┊
└────────────────────────────────────────────────────────────────────────────────────────────────────────────────────────┘
<xarray.Dataset>
Dimensions:    (longitude: 1440, latitude: 721, time: 8760)
Coordinates:
  * longitude  (longitude) float32 -180.0 -179.8 -179.5 ... 179.2 179.5 179.8
  * latitude   (latitude) float32 90.0 89.75 89.5 89.25 ... -89.5 -89.75 -90.0
  * time       (time) datetime64[ns] 1997-01-01 ... 1997-12-31T23:00:00
Data variables:
    t2m        (time, latitude, longitude) float32 dask.array<chunksize=(4, 721, 1440), meta=np.ndarray>
Attributes:
    Conventions:  CF-1.6
    history:      2020-10-01 11:30:38 UTC+1000 by era5_replication_tools-1.2....
    license:      Licence to use Copernicus Products: https://apps.ecmwf.int/...
    summary:      ERA5 is the fifth generation ECMWF atmospheric reanalysis o...
    title:        ERA5 single-levels reanalysis 2m_temperature 19970101-19970131
━━━━━━━━━━━━━━━━━━━━━━━━━━━━━━━━━━━━━━━━━━━━━━━━━━━━━━━━━━━━━━━━━━━━━━━━━━━━━━━━━━━━━━━━━━━━━━━━━━━━━━━━━━━━━━━━━━━━━━━━━━


┌────────────────────────────────────────────────────────────────────────────────────────────────────────────────────────┐
┊                                                Mon Mar 20 01:05:39 2023                                                ┊
┊                rank ▻ 19                                                                                               ┊
┊                node ▻ gadi-cpu-clx-2525.gadi.nci.org.au                                                                ┊
┊                year ▻ 1998                                                                                             ┊
┊              in_dir ▻ /g/data/rt52/era5/single-levels/reanalysis/2t/1998/*                                             ┊
┊            out_file ▻ /g/data/wb00/admin/testing/weatherbench/5.625deg/2m_temperature/2m_temperature_1998_5.625.nc     ┊
└────────────────────────────────────────────────────────────────────────────────────────────────────────────────────────┘
┌────────────────────────────────────────────────────────────────────────────────────────────────────────────────────────┐
┊                                                Mon Mar 20 01:05:41 2023                                                ┊
┊                rank ▻ 20                                                                                               ┊
┊                node ▻ gadi-cpu-clx-2526.gadi.nci.org.au                                                                ┊
┊                year ▻ 1999                                                                                             ┊
┊              in_dir ▻ /g/data/rt52/era5/single-levels/reanalysis/2t/1999/*                                             ┊
┊            out_file ▻ /g/data/wb00/admin/testing/weatherbench/5.625deg/2m_temperature/2m_temperature_1999_5.625.nc     ┊
└────────────────────────────────────────────────────────────────────────────────────────────────────────────────────────┘
<xarray.Dataset>
Dimensions:    (longitude: 1440, latitude: 721, time: 8760)
Coordinates:
  * longitude  (longitude) float32 -180.0 -179.8 -179.5 ... 179.2 179.5 179.8
  * latitude   (latitude) float32 90.0 89.75 89.5 89.25 ... -89.5 -89.75 -90.0
  * time       (time) datetime64[ns] 1998-01-01 ... 1998-12-31T23:00:00
Data variables:
    t2m        (time, latitude, longitude) float32 dask.array<chunksize=(4, 721, 1440), meta=np.ndarray>
Attributes:
    Conventions:  CF-1.6
    history:      2020-10-01 07:34:20 UTC+1000 by era5_replication_tools-1.2....
    license:      Licence to use Copernicus Products: https://apps.ecmwf.int/...
    summary:      ERA5 is the fifth generation ECMWF atmospheric reanalysis o...
    title:        ERA5 single-levels reanalysis 2m_temperature 19980101-19980131
━━━━━━━━━━━━━━━━━━━━━━━━━━━━━━━━━━━━━━━━━━━━━━━━━━━━━━━━━━━━━━━━━━━━━━━━━━━━━━━━━━━━━━━━━━━━━━━━━━━━━━━━━━━━━━━━━━━━━━━━━━


<xarray.Dataset>
Dimensions:    (longitude: 1440, latitude: 721, time: 8760)
Coordinates:
  * longitude  (longitude) float32 -180.0 -179.8 -179.5 ... 179.2 179.5 179.8
  * latitude   (latitude) float32 90.0 89.75 89.5 89.25 ... -89.5 -89.75 -90.0
  * time       (time) datetime64[ns] 1999-01-01 ... 1999-12-31T23:00:00
Data variables:
    t2m        (time, latitude, longitude) float32 dask.array<chunksize=(4, 721, 1440), meta=np.ndarray>
Attributes:
    Conventions:  CF-1.6
    history:      2020-10-01 02:18:55 UTC+1000 by era5_replication_tools-1.2....
    license:      Licence to use Copernicus Products: https://apps.ecmwf.int/...
    summary:      ERA5 is the fifth generation ECMWF atmospheric reanalysis o...
    title:        ERA5 single-levels reanalysis 2m_temperature 19990101-19990131
━━━━━━━━━━━━━━━━━━━━━━━━━━━━━━━━━━━━━━━━━━━━━━━━━━━━━━━━━━━━━━━━━━━━━━━━━━━━━━━━━━━━━━━━━━━━━━━━━━━━━━━━━━━━━━━━━━━━━━━━━━


┌────────────────────────────────────────────────────────────────────────────────────────────────────────────────────────┐
┊                                                Mon Mar 20 01:05:43 2023                                                ┊
┊                rank ▻ 21                                                                                               ┊
┊                node ▻ gadi-cpu-clx-2526.gadi.nci.org.au                                                                ┊
┊                year ▻ 2000                                                                                             ┊
┊              in_dir ▻ /g/data/rt52/era5/single-levels/reanalysis/2t/2000/*                                             ┊
┊            out_file ▻ /g/data/wb00/admin/testing/weatherbench/5.625deg/2m_temperature/2m_temperature_2000_5.625.nc     ┊
└────────────────────────────────────────────────────────────────────────────────────────────────────────────────────────┘
<xarray.Dataset>
Dimensions:    (longitude: 1440, latitude: 721, time: 8784)
Coordinates:
  * longitude  (longitude) float32 -180.0 -179.8 -179.5 ... 179.2 179.5 179.8
  * latitude   (latitude) float32 90.0 89.75 89.5 89.25 ... -89.5 -89.75 -90.0
  * time       (time) datetime64[ns] 2000-01-01 ... 2000-12-31T23:00:00
Data variables:
    t2m        (time, latitude, longitude) float32 dask.array<chunksize=(4, 721, 1440), meta=np.ndarray>
Attributes:
    Conventions:  CF-1.6
    history:      2020-09-30 21:47:55 UTC+1000 by era5_replication_tools-1.2....
    license:      Licence to use Copernicus Products: https://apps.ecmwf.int/...
    summary:      ERA5 is the fifth generation ECMWF atmospheric reanalysis o...
    title:        ERA5 single-levels reanalysis 2m_temperature 20000101-20000131
━━━━━━━━━━━━━━━━━━━━━━━━━━━━━━━━━━━━━━━━━━━━━━━━━━━━━━━━━━━━━━━━━━━━━━━━━━━━━━━━━━━━━━━━━━━━━━━━━━━━━━━━━━━━━━━━━━━━━━━━━━


┌────────────────────────────────────────────────────────────────────────────────────────────────────────────────────────┐
┊                                                Mon Mar 20 01:05:45 2023                                                ┊
┊                rank ▻ 22                                                                                               ┊
┊                node ▻ gadi-cpu-clx-2526.gadi.nci.org.au                                                                ┊
┊                year ▻ 2001                                                                                             ┊
┊              in_dir ▻ /g/data/rt52/era5/single-levels/reanalysis/2t/2001/*                                             ┊
┊            out_file ▻ /g/data/wb00/admin/testing/weatherbench/5.625deg/2m_temperature/2m_temperature_2001_5.625.nc     ┊
└────────────────────────────────────────────────────────────────────────────────────────────────────────────────────────┘
<xarray.Dataset>
Dimensions:    (longitude: 1440, latitude: 721, time: 8760)
Coordinates:
  * longitude  (longitude) float32 -180.0 -179.8 -179.5 ... 179.2 179.5 179.8
  * latitude   (latitude) float32 90.0 89.75 89.5 89.25 ... -89.5 -89.75 -90.0
  * time       (time) datetime64[ns] 2001-01-01 ... 2001-12-31T23:00:00
Data variables:
    t2m        (time, latitude, longitude) float32 dask.array<chunksize=(4, 721, 1440), meta=np.ndarray>
Attributes:
    Conventions:  CF-1.6
    history:      2020-09-30 15:34:48 UTC+1000 by era5_replication_tools-1.2....
    license:      Licence to use Copernicus Products: https://apps.ecmwf.int/...
    summary:      ERA5 is the fifth generation ECMWF atmospheric reanalysis o...
    title:        ERA5 single-levels reanalysis 2m_temperature 20010101-20010131
━━━━━━━━━━━━━━━━━━━━━━━━━━━━━━━━━━━━━━━━━━━━━━━━━━━━━━━━━━━━━━━━━━━━━━━━━━━━━━━━━━━━━━━━━━━━━━━━━━━━━━━━━━━━━━━━━━━━━━━━━━


┌────────────────────────────────────────────────────────────────────────────────────────────────────────────────────────┐
┊                                                Mon Mar 20 01:05:47 2023                                                ┊
┊                rank ▻ 23                                                                                               ┊
┊                node ▻ gadi-cpu-clx-2526.gadi.nci.org.au                                                                ┊
┊                year ▻ 2002                                                                                             ┊
┊              in_dir ▻ /g/data/rt52/era5/single-levels/reanalysis/2t/2002/*                                             ┊
┊            out_file ▻ /g/data/wb00/admin/testing/weatherbench/5.625deg/2m_temperature/2m_temperature_2002_5.625.nc     ┊
└────────────────────────────────────────────────────────────────────────────────────────────────────────────────────────┘
<xarray.Dataset>
Dimensions:    (longitude: 1440, latitude: 721, time: 8760)
Coordinates:
  * longitude  (longitude) float32 -180.0 -179.8 -179.5 ... 179.2 179.5 179.8
  * latitude   (latitude) float32 90.0 89.75 89.5 89.25 ... -89.5 -89.75 -90.0
  * time       (time) datetime64[ns] 2002-01-01 ... 2002-12-31T23:00:00
Data variables:
    t2m        (time, latitude, longitude) float32 dask.array<chunksize=(4, 721, 1440), meta=np.ndarray>
Attributes:
    Conventions:  CF-1.6
    history:      2020-09-30 11:51:52 UTC+1000 by era5_replication_tools-1.2....
    license:      Licence to use Copernicus Products: https://apps.ecmwf.int/...
    summary:      ERA5 is the fifth generation ECMWF atmospheric reanalysis o...
    title:        ERA5 single-levels reanalysis 2m_temperature 20020101-20020131
━━━━━━━━━━━━━━━━━━━━━━━━━━━━━━━━━━━━━━━━━━━━━━━━━━━━━━━━━━━━━━━━━━━━━━━━━━━━━━━━━━━━━━━━━━━━━━━━━━━━━━━━━━━━━━━━━━━━━━━━━━


┌────────────────────────────────────────────────────────────────────────────────────────────────────────────────────────┐
┊                                                Mon Mar 20 01:05:49 2023                                                ┊
┊                rank ▻ 24                                                                                               ┊
┊                node ▻ gadi-cpu-clx-2527.gadi.nci.org.au                                                                ┊
┊                year ▻ 2003                                                                                             ┊
┊              in_dir ▻ /g/data/rt52/era5/single-levels/reanalysis/2t/2003/*                                             ┊
┊            out_file ▻ /g/data/wb00/admin/testing/weatherbench/5.625deg/2m_temperature/2m_temperature_2003_5.625.nc     ┊
└────────────────────────────────────────────────────────────────────────────────────────────────────────────────────────┘
<xarray.Dataset>
Dimensions:    (longitude: 1440, latitude: 721, time: 8760)
Coordinates:
  * longitude  (longitude) float32 -180.0 -179.8 -179.5 ... 179.2 179.5 179.8
  * latitude   (latitude) float32 90.0 89.75 89.5 89.25 ... -89.5 -89.75 -90.0
  * time       (time) datetime64[ns] 2003-01-01 ... 2003-12-31T23:00:00
Data variables:
    t2m        (time, latitude, longitude) float32 dask.array<chunksize=(4, 721, 1440), meta=np.ndarray>
Attributes:
    Conventions:  CF-1.6
    history:      2020-09-30 07:18:52 UTC+1000 by era5_replication_tools-1.2....
    license:      Licence to use Copernicus Products: https://apps.ecmwf.int/...
    summary:      ERA5 is the fifth generation ECMWF atmospheric reanalysis o...
    title:        ERA5 single-levels reanalysis 2m_temperature 20030101-20030131
━━━━━━━━━━━━━━━━━━━━━━━━━━━━━━━━━━━━━━━━━━━━━━━━━━━━━━━━━━━━━━━━━━━━━━━━━━━━━━━━━━━━━━━━━━━━━━━━━━━━━━━━━━━━━━━━━━━━━━━━━━


┌────────────────────────────────────────────────────────────────────────────────────────────────────────────────────────┐
┊                                                Mon Mar 20 01:05:51 2023                                                ┊
┊                rank ▻ 25                                                                                               ┊
┊                node ▻ gadi-cpu-clx-2527.gadi.nci.org.au                                                                ┊
┊                year ▻ 2004                                                                                             ┊
┊              in_dir ▻ /g/data/rt52/era5/single-levels/reanalysis/2t/2004/*                                             ┊
┊            out_file ▻ /g/data/wb00/admin/testing/weatherbench/5.625deg/2m_temperature/2m_temperature_2004_5.625.nc     ┊
└────────────────────────────────────────────────────────────────────────────────────────────────────────────────────────┘
<xarray.Dataset>
Dimensions:    (longitude: 1440, latitude: 721, time: 8784)
Coordinates:
  * longitude  (longitude) float32 -180.0 -179.8 -179.5 ... 179.2 179.5 179.8
  * latitude   (latitude) float32 90.0 89.75 89.5 89.25 ... -89.5 -89.75 -90.0
  * time       (time) datetime64[ns] 2004-01-01 ... 2004-12-31T23:00:00
Data variables:
    t2m        (time, latitude, longitude) float32 dask.array<chunksize=(4, 721, 1440), meta=np.ndarray>
Attributes:
    Conventions:  CF-1.6
    history:      2020-09-30 01:14:38 UTC+1000 by era5_replication_tools-1.2....
    license:      Licence to use Copernicus Products: https://apps.ecmwf.int/...
    summary:      ERA5 is the fifth generation ECMWF atmospheric reanalysis o...
    title:        ERA5 single-levels reanalysis 2m_temperature 20040101-20040131
━━━━━━━━━━━━━━━━━━━━━━━━━━━━━━━━━━━━━━━━━━━━━━━━━━━━━━━━━━━━━━━━━━━━━━━━━━━━━━━━━━━━━━━━━━━━━━━━━━━━━━━━━━━━━━━━━━━━━━━━━━


┌────────────────────────────────────────────────────────────────────────────────────────────────────────────────────────┐
┊                                                Mon Mar 20 01:05:53 2023                                                ┊
┊                rank ▻ 26                                                                                               ┊
┊                node ▻ gadi-cpu-clx-2527.gadi.nci.org.au                                                                ┊
┊                year ▻ 2005                                                                                             ┊
┊              in_dir ▻ /g/data/rt52/era5/single-levels/reanalysis/2t/2005/*                                             ┊
┊            out_file ▻ /g/data/wb00/admin/testing/weatherbench/5.625deg/2m_temperature/2m_temperature_2005_5.625.nc     ┊
└────────────────────────────────────────────────────────────────────────────────────────────────────────────────────────┘
<xarray.Dataset>
Dimensions:    (longitude: 1440, latitude: 721, time: 8760)
Coordinates:
  * longitude  (longitude) float32 -180.0 -179.8 -179.5 ... 179.2 179.5 179.8
  * latitude   (latitude) float32 90.0 89.75 89.5 89.25 ... -89.5 -89.75 -90.0
  * time       (time) datetime64[ns] 2005-01-01 ... 2005-12-31T23:00:00
Data variables:
    t2m        (time, latitude, longitude) float32 dask.array<chunksize=(4, 721, 1440), meta=np.ndarray>
Attributes:
    Conventions:  CF-1.6
    history:      2020-09-29 17:26:42 UTC+1000 by era5_replication_tools-1.2....
    license:      Licence to use Copernicus Products: https://apps.ecmwf.int/...
    summary:      ERA5 is the fifth generation ECMWF atmospheric reanalysis o...
    title:        ERA5 single-levels reanalysis 2m_temperature 20050101-20050131
━━━━━━━━━━━━━━━━━━━━━━━━━━━━━━━━━━━━━━━━━━━━━━━━━━━━━━━━━━━━━━━━━━━━━━━━━━━━━━━━━━━━━━━━━━━━━━━━━━━━━━━━━━━━━━━━━━━━━━━━━━


┌────────────────────────────────────────────────────────────────────────────────────────────────────────────────────────┐
┊                                                Mon Mar 20 01:05:55 2023                                                ┊
┊                rank ▻ 27                                                                                               ┊
┊                node ▻ gadi-cpu-clx-2527.gadi.nci.org.au                                                                ┊
┊                year ▻ 2006                                                                                             ┊
┊              in_dir ▻ /g/data/rt52/era5/single-levels/reanalysis/2t/2006/*                                             ┊
┊            out_file ▻ /g/data/wb00/admin/testing/weatherbench/5.625deg/2m_temperature/2m_temperature_2006_5.625.nc     ┊
└────────────────────────────────────────────────────────────────────────────────────────────────────────────────────────┘
┌────────────────────────────────────────────────────────────────────────────────────────────────────────────────────────┐
┊                                                Mon Mar 20 01:05:57 2023                                                ┊
┊                rank ▻ 28                                                                                               ┊
┊                node ▻ gadi-cpu-clx-2528.gadi.nci.org.au                                                                ┊
┊                year ▻ 2007                                                                                             ┊
┊              in_dir ▻ /g/data/rt52/era5/single-levels/reanalysis/2t/2007/*                                             ┊
┊            out_file ▻ /g/data/wb00/admin/testing/weatherbench/5.625deg/2m_temperature/2m_temperature_2007_5.625.nc     ┊
└────────────────────────────────────────────────────────────────────────────────────────────────────────────────────────┘
<xarray.Dataset>
Dimensions:    (longitude: 1440, latitude: 721, time: 8760)
Coordinates:
  * longitude  (longitude) float32 -180.0 -179.8 -179.5 ... 179.2 179.5 179.8
  * latitude   (latitude) float32 90.0 89.75 89.5 89.25 ... -89.5 -89.75 -90.0
  * time       (time) datetime64[ns] 2006-01-01 ... 2006-12-31T23:00:00
Data variables:
    t2m        (time, latitude, longitude) float32 dask.array<chunksize=(4, 721, 1440), meta=np.ndarray>
Attributes:
    Conventions:  CF-1.6
    history:      2020-09-29 12:16:50 UTC+1000 by era5_replication_tools-1.2....
    license:      Licence to use Copernicus Products: https://apps.ecmwf.int/...
    summary:      ERA5 is the fifth generation ECMWF atmospheric reanalysis o...
    title:        ERA5 single-levels reanalysis 2m_temperature 20060101-20060131
━━━━━━━━━━━━━━━━━━━━━━━━━━━━━━━━━━━━━━━━━━━━━━━━━━━━━━━━━━━━━━━━━━━━━━━━━━━━━━━━━━━━━━━━━━━━━━━━━━━━━━━━━━━━━━━━━━━━━━━━━━


┌────────────────────────────────────────────────────────────────────────────────────────────────────────────────────────┐
┊                                                Mon Mar 20 01:05:59 2023                                                ┊
┊                rank ▻ 29                                                                                               ┊
┊                node ▻ gadi-cpu-clx-2528.gadi.nci.org.au                                                                ┊
┊                year ▻ 2008                                                                                             ┊
┊              in_dir ▻ /g/data/rt52/era5/single-levels/reanalysis/2t/2008/*                                             ┊
┊            out_file ▻ /g/data/wb00/admin/testing/weatherbench/5.625deg/2m_temperature/2m_temperature_2008_5.625.nc     ┊
└────────────────────────────────────────────────────────────────────────────────────────────────────────────────────────┘
<xarray.Dataset>
Dimensions:    (longitude: 1440, latitude: 721, time: 8760)
Coordinates:
  * longitude  (longitude) float32 -180.0 -179.8 -179.5 ... 179.2 179.5 179.8
  * latitude   (latitude) float32 90.0 89.75 89.5 89.25 ... -89.5 -89.75 -90.0
  * time       (time) datetime64[ns] 2007-01-01 ... 2007-12-31T23:00:00
Data variables:
    t2m        (time, latitude, longitude) float32 dask.array<chunksize=(4, 721, 1440), meta=np.ndarray>
Attributes:
    Conventions:  CF-1.6
    history:      2020-09-29 06:57:15 UTC+1000 by era5_replication_tools-1.2....
    license:      Licence to use Copernicus Products: https://apps.ecmwf.int/...
    summary:      ERA5 is the fifth generation ECMWF atmospheric reanalysis o...
    title:        ERA5 single-levels reanalysis 2m_temperature 20070101-20070131
━━━━━━━━━━━━━━━━━━━━━━━━━━━━━━━━━━━━━━━━━━━━━━━━━━━━━━━━━━━━━━━━━━━━━━━━━━━━━━━━━━━━━━━━━━━━━━━━━━━━━━━━━━━━━━━━━━━━━━━━━━


┌────────────────────────────────────────────────────────────────────────────────────────────────────────────────────────┐
┊                                                Mon Mar 20 01:06:01 2023                                                ┊
┊                rank ▻ 30                                                                                               ┊
┊                node ▻ gadi-cpu-clx-2528.gadi.nci.org.au                                                                ┊
┊                year ▻ 2009                                                                                             ┊
┊              in_dir ▻ /g/data/rt52/era5/single-levels/reanalysis/2t/2009/*                                             ┊
┊            out_file ▻ /g/data/wb00/admin/testing/weatherbench/5.625deg/2m_temperature/2m_temperature_2009_5.625.nc     ┊
└────────────────────────────────────────────────────────────────────────────────────────────────────────────────────────┘
<xarray.Dataset>
Dimensions:    (longitude: 1440, latitude: 721, time: 8760)
Coordinates:
  * longitude  (longitude) float32 -180.0 -179.8 -179.5 ... 179.2 179.5 179.8
  * latitude   (latitude) float32 90.0 89.75 89.5 89.25 ... -89.5 -89.75 -90.0
  * time       (time) datetime64[ns] 2009-01-01 ... 2009-12-31T23:00:00
Data variables:
    t2m        (time, latitude, longitude) float32 dask.array<chunksize=(4, 721, 1440), meta=np.ndarray>
Attributes:
    Conventions:  CF-1.6
    history:      2020-09-28 17:30:50 UTC+1000 by era5_replication_tools-1.2....
    license:      Licence to use Copernicus Products: https://apps.ecmwf.int/...
    summary:      ERA5 is the fifth generation ECMWF atmospheric reanalysis o...
    title:        ERA5 single-levels reanalysis 2m_temperature 20090101-20090131
━━━━━━━━━━━━━━━━━━━━━━━━━━━━━━━━━━━━━━━━━━━━━━━━━━━━━━━━━━━━━━━━━━━━━━━━━━━━━━━━━━━━━━━━━━━━━━━━━━━━━━━━━━━━━━━━━━━━━━━━━━


┌────────────────────────────────────────────────────────────────────────────────────────────────────────────────────────┐
┊                                                Mon Mar 20 01:06:03 2023                                                ┊
┊                rank ▻ 31                                                                                               ┊
┊                node ▻ gadi-cpu-clx-2528.gadi.nci.org.au                                                                ┊
┊                year ▻ 2010                                                                                             ┊
┊              in_dir ▻ /g/data/rt52/era5/single-levels/reanalysis/2t/2010/*                                             ┊
┊            out_file ▻ /g/data/wb00/admin/testing/weatherbench/5.625deg/2m_temperature/2m_temperature_2010_5.625.nc     ┊
└────────────────────────────────────────────────────────────────────────────────────────────────────────────────────────┘
<xarray.Dataset>
Dimensions:    (longitude: 1440, latitude: 721, time: 8784)
Coordinates:
  * longitude  (longitude) float32 -180.0 -179.8 -179.5 ... 179.2 179.5 179.8
  * latitude   (latitude) float32 90.0 89.75 89.5 89.25 ... -89.5 -89.75 -90.0
  * time       (time) datetime64[ns] 2008-01-01 ... 2008-12-31T23:00:00
Data variables:
    t2m        (time, latitude, longitude) float32 dask.array<chunksize=(4, 721, 1440), meta=np.ndarray>
Attributes:
    Conventions:  CF-1.6
    history:      2020-09-28 22:31:39 UTC+1000 by era5_replication_tools-1.2....
    license:      Licence to use Copernicus Products: https://apps.ecmwf.int/...
    summary:      ERA5 is the fifth generation ECMWF atmospheric reanalysis o...
    title:        ERA5 single-levels reanalysis 2m_temperature 20080101-20080131
━━━━━━━━━━━━━━━━━━━━━━━━━━━━━━━━━━━━━━━━━━━━━━━━━━━━━━━━━━━━━━━━━━━━━━━━━━━━━━━━━━━━━━━━━━━━━━━━━━━━━━━━━━━━━━━━━━━━━━━━━━


<xarray.Dataset>
Dimensions:    (longitude: 1440, latitude: 721, time: 8760)
Coordinates:
  * longitude  (longitude) float32 -180.0 -179.8 -179.5 ... 179.2 179.5 179.8
  * latitude   (latitude) float32 90.0 89.75 89.5 89.25 ... -89.5 -89.75 -90.0
  * time       (time) datetime64[ns] 2010-01-01 ... 2010-12-31T23:00:00
Data variables:
    t2m        (time, latitude, longitude) float32 dask.array<chunksize=(4, 721, 1440), meta=np.ndarray>
Attributes:
    Conventions:  CF-1.6
    history:      2020-09-28 12:42:00 UTC+1000 by era5_replication_tools-1.2....
    license:      Licence to use Copernicus Products: https://apps.ecmwf.int/...
    summary:      ERA5 is the fifth generation ECMWF atmospheric reanalysis o...
    title:        ERA5 single-levels reanalysis 2m_temperature 20100101-20100131
━━━━━━━━━━━━━━━━━━━━━━━━━━━━━━━━━━━━━━━━━━━━━━━━━━━━━━━━━━━━━━━━━━━━━━━━━━━━━━━━━━━━━━━━━━━━━━━━━━━━━━━━━━━━━━━━━━━━━━━━━━


┌────────────────────────────────────────────────────────────────────────────────────────────────────────────────────────┐
┊                                                Mon Mar 20 01:06:05 2023                                                ┊
┊                rank ▻ 32                                                                                               ┊
┊                node ▻ gadi-cpu-clx-2529.gadi.nci.org.au                                                                ┊
┊                year ▻ 2011                                                                                             ┊
┊              in_dir ▻ /g/data/rt52/era5/single-levels/reanalysis/2t/2011/*                                             ┊
┊            out_file ▻ /g/data/wb00/admin/testing/weatherbench/5.625deg/2m_temperature/2m_temperature_2011_5.625.nc     ┊
└────────────────────────────────────────────────────────────────────────────────────────────────────────────────────────┘
┌────────────────────────────────────────────────────────────────────────────────────────────────────────────────────────┐
┊                                                Mon Mar 20 01:06:07 2023                                                ┊
┊                rank ▻ 33                                                                                               ┊
┊                node ▻ gadi-cpu-clx-2529.gadi.nci.org.au                                                                ┊
┊                year ▻ 2012                                                                                             ┊
┊              in_dir ▻ /g/data/rt52/era5/single-levels/reanalysis/2t/2012/*                                             ┊
┊            out_file ▻ /g/data/wb00/admin/testing/weatherbench/5.625deg/2m_temperature/2m_temperature_2012_5.625.nc     ┊
└────────────────────────────────────────────────────────────────────────────────────────────────────────────────────────┘
<xarray.Dataset>
Dimensions:    (longitude: 1440, latitude: 721, time: 8760)
Coordinates:
  * longitude  (longitude) float32 -180.0 -179.8 -179.5 ... 179.2 179.5 179.8
  * latitude   (latitude) float32 90.0 89.75 89.5 89.25 ... -89.5 -89.75 -90.0
  * time       (time) datetime64[ns] 2011-01-01 ... 2011-12-31T23:00:00
Data variables:
    t2m        (time, latitude, longitude) float32 dask.array<chunksize=(4, 721, 1440), meta=np.ndarray>
Attributes:
    Conventions:  CF-1.6
    history:      2020-09-28 08:40:54 UTC+1000 by era5_replication_tools-1.2....
    license:      Licence to use Copernicus Products: https://apps.ecmwf.int/...
    summary:      ERA5 is the fifth generation ECMWF atmospheric reanalysis o...
    title:        ERA5 single-levels reanalysis 2m_temperature 20110101-20110131
━━━━━━━━━━━━━━━━━━━━━━━━━━━━━━━━━━━━━━━━━━━━━━━━━━━━━━━━━━━━━━━━━━━━━━━━━━━━━━━━━━━━━━━━━━━━━━━━━━━━━━━━━━━━━━━━━━━━━━━━━━


┌────────────────────────────────────────────────────────────────────────────────────────────────────────────────────────┐
┊                                                Mon Mar 20 01:06:09 2023                                                ┊
┊                rank ▻ 34                                                                                               ┊
┊                node ▻ gadi-cpu-clx-2529.gadi.nci.org.au                                                                ┊
┊                year ▻ 2013                                                                                             ┊
┊              in_dir ▻ /g/data/rt52/era5/single-levels/reanalysis/2t/2013/*                                             ┊
┊            out_file ▻ /g/data/wb00/admin/testing/weatherbench/5.625deg/2m_temperature/2m_temperature_2013_5.625.nc     ┊
└────────────────────────────────────────────────────────────────────────────────────────────────────────────────────────┘
<xarray.Dataset>
Dimensions:    (longitude: 1440, latitude: 721, time: 8760)
Coordinates:
  * longitude  (longitude) float32 -180.0 -179.8 -179.5 ... 179.2 179.5 179.8
  * latitude   (latitude) float32 90.0 89.75 89.5 89.25 ... -89.5 -89.75 -90.0
  * time       (time) datetime64[ns] 2013-01-01 ... 2013-12-31T23:00:00
Data variables:
    t2m        (time, latitude, longitude) float32 dask.array<chunksize=(4, 721, 1440), meta=np.ndarray>
Attributes:
    Conventions:  CF-1.6
    history:      2020-09-27 23:35:10 UTC+1000 by era5_replication_tools-1.2....
    license:      Licence to use Copernicus Products: https://apps.ecmwf.int/...
    summary:      ERA5 is the fifth generation ECMWF atmospheric reanalysis o...
    title:        ERA5 single-levels reanalysis 2m_temperature 20130101-20130131
━━━━━━━━━━━━━━━━━━━━━━━━━━━━━━━━━━━━━━━━━━━━━━━━━━━━━━━━━━━━━━━━━━━━━━━━━━━━━━━━━━━━━━━━━━━━━━━━━━━━━━━━━━━━━━━━━━━━━━━━━━


<xarray.Dataset>
Dimensions:    (longitude: 1440, latitude: 721, time: 8784)
Coordinates:
  * longitude  (longitude) float32 -180.0 -179.8 -179.5 ... 179.2 179.5 179.8
  * latitude   (latitude) float32 90.0 89.75 89.5 89.25 ... -89.5 -89.75 -90.0
  * time       (time) datetime64[ns] 2012-01-01 ... 2012-12-31T23:00:00
Data variables:
    t2m        (time, latitude, longitude) float32 dask.array<chunksize=(4, 721, 1440), meta=np.ndarray>
Attributes:
    Conventions:  CF-1.6
    history:      2020-09-28 03:25:57 UTC+1000 by era5_replication_tools-1.2....
    license:      Licence to use Copernicus Products: https://apps.ecmwf.int/...
    summary:      ERA5 is the fifth generation ECMWF atmospheric reanalysis o...
    title:        ERA5 single-levels reanalysis 2m_temperature 20120101-20120131
━━━━━━━━━━━━━━━━━━━━━━━━━━━━━━━━━━━━━━━━━━━━━━━━━━━━━━━━━━━━━━━━━━━━━━━━━━━━━━━━━━━━━━━━━━━━━━━━━━━━━━━━━━━━━━━━━━━━━━━━━━


┌────────────────────────────────────────────────────────────────────────────────────────────────────────────────────────┐
┊                                                Mon Mar 20 01:06:11 2023                                                ┊
┊                rank ▻ 35                                                                                               ┊
┊                node ▻ gadi-cpu-clx-2529.gadi.nci.org.au                                                                ┊
┊                year ▻ 2014                                                                                             ┊
┊              in_dir ▻ /g/data/rt52/era5/single-levels/reanalysis/2t/2014/*                                             ┊
┊            out_file ▻ /g/data/wb00/admin/testing/weatherbench/5.625deg/2m_temperature/2m_temperature_2014_5.625.nc     ┊
└────────────────────────────────────────────────────────────────────────────────────────────────────────────────────────┘
<xarray.Dataset>
Dimensions:    (longitude: 1440, latitude: 721, time: 8760)
Coordinates:
  * longitude  (longitude) float32 -180.0 -179.8 -179.5 ... 179.2 179.5 179.8
  * latitude   (latitude) float32 90.0 89.75 89.5 89.25 ... -89.5 -89.75 -90.0
  * time       (time) datetime64[ns] 2014-01-01 ... 2014-12-31T23:00:00
Data variables:
    t2m        (time, latitude, longitude) float32 dask.array<chunksize=(4, 721, 1440), meta=np.ndarray>
Attributes:
    Conventions:  CF-1.6
    history:      2020-09-27 19:18:09 UTC+1000 by era5_replication_tools-1.2....
    license:      Licence to use Copernicus Products: https://apps.ecmwf.int/...
    summary:      ERA5 is the fifth generation ECMWF atmospheric reanalysis o...
    title:        ERA5 single-levels reanalysis 2m_temperature 20140101-20140131
━━━━━━━━━━━━━━━━━━━━━━━━━━━━━━━━━━━━━━━━━━━━━━━━━━━━━━━━━━━━━━━━━━━━━━━━━━━━━━━━━━━━━━━━━━━━━━━━━━━━━━━━━━━━━━━━━━━━━━━━━━


┌────────────────────────────────────────────────────────────────────────────────────────────────────────────────────────┐
┊                                                Mon Mar 20 01:06:13 2023                                                ┊
┊                rank ▻ 36                                                                                               ┊
┊                node ▻ gadi-cpu-clx-2530.gadi.nci.org.au                                                                ┊
┊                year ▻ 2015                                                                                             ┊
┊              in_dir ▻ /g/data/rt52/era5/single-levels/reanalysis/2t/2015/*                                             ┊
┊            out_file ▻ /g/data/wb00/admin/testing/weatherbench/5.625deg/2m_temperature/2m_temperature_2015_5.625.nc     ┊
└────────────────────────────────────────────────────────────────────────────────────────────────────────────────────────┘
<xarray.Dataset>
Dimensions:    (longitude: 1440, latitude: 721, time: 8760)
Coordinates:
  * longitude  (longitude) float32 -180.0 -179.8 -179.5 ... 179.2 179.5 179.8
  * latitude   (latitude) float32 90.0 89.75 89.5 89.25 ... -89.5 -89.75 -90.0
  * time       (time) datetime64[ns] 2015-01-01 ... 2015-12-31T23:00:00
Data variables:
    t2m        (time, latitude, longitude) float32 dask.array<chunksize=(4, 721, 1440), meta=np.ndarray>
Attributes:
    Conventions:  CF-1.6
    history:      2020-09-27 14:12:49 UTC+1000 by era5_replication_tools-1.2....
    license:      Licence to use Copernicus Products: https://apps.ecmwf.int/...
    summary:      ERA5 is the fifth generation ECMWF atmospheric reanalysis o...
    title:        ERA5 single-levels reanalysis 2m_temperature 20150101-20150131
━━━━━━━━━━━━━━━━━━━━━━━━━━━━━━━━━━━━━━━━━━━━━━━━━━━━━━━━━━━━━━━━━━━━━━━━━━━━━━━━━━━━━━━━━━━━━━━━━━━━━━━━━━━━━━━━━━━━━━━━━━


┌────────────────────────────────────────────────────────────────────────────────────────────────────────────────────────┐
┊                                                Mon Mar 20 01:06:15 2023                                                ┊
┊                rank ▻ 37                                                                                               ┊
┊                node ▻ gadi-cpu-clx-2530.gadi.nci.org.au                                                                ┊
┊                year ▻ 2016                                                                                             ┊
┊              in_dir ▻ /g/data/rt52/era5/single-levels/reanalysis/2t/2016/*                                             ┊
┊            out_file ▻ /g/data/wb00/admin/testing/weatherbench/5.625deg/2m_temperature/2m_temperature_2016_5.625.nc     ┊
└────────────────────────────────────────────────────────────────────────────────────────────────────────────────────────┘
<xarray.Dataset>
Dimensions:    (longitude: 1440, latitude: 721, time: 8784)
Coordinates:
  * longitude  (longitude) float32 -180.0 -179.8 -179.5 ... 179.2 179.5 179.8
  * latitude   (latitude) float32 90.0 89.75 89.5 89.25 ... -89.5 -89.75 -90.0
  * time       (time) datetime64[ns] 2016-01-01 ... 2016-12-31T23:00:00
Data variables:
    t2m        (time, latitude, longitude) float32 dask.array<chunksize=(4, 721, 1440), meta=np.ndarray>
Attributes:
    Conventions:  CF-1.6
    history:      2020-09-27 09:41:09 UTC+1000 by era5_replication_tools-1.2....
    license:      Licence to use Copernicus Products: https://apps.ecmwf.int/...
    summary:      ERA5 is the fifth generation ECMWF atmospheric reanalysis o...
    title:        ERA5 single-levels reanalysis 2m_temperature 20160101-20160131
━━━━━━━━━━━━━━━━━━━━━━━━━━━━━━━━━━━━━━━━━━━━━━━━━━━━━━━━━━━━━━━━━━━━━━━━━━━━━━━━━━━━━━━━━━━━━━━━━━━━━━━━━━━━━━━━━━━━━━━━━━


┌────────────────────────────────────────────────────────────────────────────────────────────────────────────────────────┐
┊                                                Mon Mar 20 01:06:17 2023                                                ┊
┊                rank ▻ 38                                                                                               ┊
┊                node ▻ gadi-cpu-clx-2530.gadi.nci.org.au                                                                ┊
┊                year ▻ 2017                                                                                             ┊
┊              in_dir ▻ /g/data/rt52/era5/single-levels/reanalysis/2t/2017/*                                             ┊
┊            out_file ▻ /g/data/wb00/admin/testing/weatherbench/5.625deg/2m_temperature/2m_temperature_2017_5.625.nc     ┊
└────────────────────────────────────────────────────────────────────────────────────────────────────────────────────────┘
<xarray.Dataset>
Dimensions:    (longitude: 1440, latitude: 721, time: 8760)
Coordinates:
  * longitude  (longitude) float32 -180.0 -179.8 -179.5 ... 179.2 179.5 179.8
  * latitude   (latitude) float32 90.0 89.75 89.5 89.25 ... -89.5 -89.75 -90.0
  * time       (time) datetime64[ns] 2017-01-01 ... 2017-12-31T23:00:00
Data variables:
    t2m        (time, latitude, longitude) float32 dask.array<chunksize=(4, 721, 1440), meta=np.ndarray>
Attributes:
    Conventions:  CF-1.6
    history:      2020-09-27 03:50:54 UTC+1000 by era5_replication_tools-1.2....
    license:      Licence to use Copernicus Products: https://apps.ecmwf.int/...
    summary:      ERA5 is the fifth generation ECMWF atmospheric reanalysis o...
    title:        ERA5 single-levels reanalysis 2m_temperature 20170101-20170131
━━━━━━━━━━━━━━━━━━━━━━━━━━━━━━━━━━━━━━━━━━━━━━━━━━━━━━━━━━━━━━━━━━━━━━━━━━━━━━━━━━━━━━━━━━━━━━━━━━━━━━━━━━━━━━━━━━━━━━━━━━


┌────────────────────────────────────────────────────────────────────────────────────────────────────────────────────────┐
┊                                                Mon Mar 20 01:06:19 2023                                                ┊
┊                rank ▻ 39                                                                                               ┊
┊                node ▻ gadi-cpu-clx-2530.gadi.nci.org.au                                                                ┊
┊                year ▻ 2018                                                                                             ┊
┊              in_dir ▻ /g/data/rt52/era5/single-levels/reanalysis/2t/2018/*                                             ┊
┊            out_file ▻ /g/data/wb00/admin/testing/weatherbench/5.625deg/2m_temperature/2m_temperature_2018_5.625.nc     ┊
└────────────────────────────────────────────────────────────────────────────────────────────────────────────────────────┘
<xarray.Dataset>
Dimensions:    (longitude: 1440, latitude: 721, time: 8760)
Coordinates:
  * longitude  (longitude) float32 -180.0 -179.8 -179.5 ... 179.2 179.5 179.8
  * latitude   (latitude) float32 90.0 89.75 89.5 89.25 ... -89.5 -89.75 -90.0
  * time       (time) datetime64[ns] 2018-01-01 ... 2018-12-31T23:00:00
Data variables:
    t2m        (time, latitude, longitude) float32 dask.array<chunksize=(4, 721, 1440), meta=np.ndarray>
Attributes:
    Conventions:  CF-1.6
    history:      2020-09-26 23:31:02 UTC+1000 by era5_replication_tools-1.2....
    license:      Licence to use Copernicus Products: https://apps.ecmwf.int/...
    summary:      ERA5 is the fifth generation ECMWF atmospheric reanalysis o...
    title:        ERA5 single-levels reanalysis 2m_temperature 20180101-20180131
━━━━━━━━━━━━━━━━━━━━━━━━━━━━━━━━━━━━━━━━━━━━━━━━━━━━━━━━━━━━━━━━━━━━━━━━━━━━━━━━━━━━━━━━━━━━━━━━━━━━━━━━━━━━━━━━━━━━━━━━━━


[Mon 20 01:25:45]  End rank: 0,      Out file: /g/data/wb00/admin/testing/weatherbench/5.625deg/2m_temperature/2m_temperature_1979_5.625.nc

[Mon 20 01:25:50]  End rank: 5,      Out file: /g/data/wb00/admin/testing/weatherbench/5.625deg/2m_temperature/2m_temperature_1984_5.625.nc

[Mon 20 01:25:52]  End rank: 4,      Out file: /g/data/wb00/admin/testing/weatherbench/5.625deg/2m_temperature/2m_temperature_1983_5.625.nc

[Mon 20 01:26:05]  End rank: 7,      Out file: /g/data/wb00/admin/testing/weatherbench/5.625deg/2m_temperature/2m_temperature_1986_5.625.nc

[Mon 20 01:26:06]  End rank: 6,      Out file: /g/data/wb00/admin/testing/weatherbench/5.625deg/2m_temperature/2m_temperature_1985_5.625.nc

[Mon 20 01:26:22]  End rank: 10,     Out file: /g/data/wb00/admin/testing/weatherbench/5.625deg/2m_temperature/2m_temperature_1989_5.625.nc

[Mon 20 01:26:22]  End rank: 16,     Out file: /g/data/wb00/admin/testing/weatherbench/5.625deg/2m_temperature/2m_temperature_1995_5.625.nc

[Mon 20 01:26:23]  End rank: 8,      Out file: /g/data/wb00/admin/testing/weatherbench/5.625deg/2m_temperature/2m_temperature_1987_5.625.nc

[Mon 20 01:26:24]  End rank: 1,      Out file: /g/data/wb00/admin/testing/weatherbench/5.625deg/2m_temperature/2m_temperature_1980_5.625.nc

[Mon 20 01:26:25]  End rank: 13,     Out file: /g/data/wb00/admin/testing/weatherbench/5.625deg/2m_temperature/2m_temperature_1992_5.625.nc

[Mon 20 01:26:25]  End rank: 9,      Out file: /g/data/wb00/admin/testing/weatherbench/5.625deg/2m_temperature/2m_temperature_1988_5.625.nc

[Mon 20 01:26:26]  End rank: 14,     Out file: /g/data/wb00/admin/testing/weatherbench/5.625deg/2m_temperature/2m_temperature_1993_5.625.nc

[Mon 20 01:26:32]  End rank: 11,     Out file: /g/data/wb00/admin/testing/weatherbench/5.625deg/2m_temperature/2m_temperature_1990_5.625.nc

[Mon 20 01:26:33]  End rank: 2,      Out file: /g/data/wb00/admin/testing/weatherbench/5.625deg/2m_temperature/2m_temperature_1981_5.625.nc

[Mon 20 01:26:41]  End rank: 20,     Out file: /g/data/wb00/admin/testing/weatherbench/5.625deg/2m_temperature/2m_temperature_1999_5.625.nc

[Mon 20 01:26:41]  End rank: 3,      Out file: /g/data/wb00/admin/testing/weatherbench/5.625deg/2m_temperature/2m_temperature_1982_5.625.nc

[Mon 20 01:26:44]  End rank: 26,     Out file: /g/data/wb00/admin/testing/weatherbench/5.625deg/2m_temperature/2m_temperature_2005_5.625.nc

[Mon 20 01:26:47]  End rank: 25,     Out file: /g/data/wb00/admin/testing/weatherbench/5.625deg/2m_temperature/2m_temperature_2004_5.625.nc

[Mon 20 01:26:56]  End rank: 21,     Out file: /g/data/wb00/admin/testing/weatherbench/5.625deg/2m_temperature/2m_temperature_2000_5.625.nc

[Mon 20 01:26:56]  End rank: 12,     Out file: /g/data/wb00/admin/testing/weatherbench/5.625deg/2m_temperature/2m_temperature_1991_5.625.nc

[Mon 20 01:26:57]  End rank: 30,     Out file: /g/data/wb00/admin/testing/weatherbench/5.625deg/2m_temperature/2m_temperature_2009_5.625.nc

[Mon 20 01:26:59]  End rank: 24,     Out file: /g/data/wb00/admin/testing/weatherbench/5.625deg/2m_temperature/2m_temperature_2003_5.625.nc

[Mon 20 01:27:00]  End rank: 28,     Out file: /g/data/wb00/admin/testing/weatherbench/5.625deg/2m_temperature/2m_temperature_2007_5.625.nc

[Mon 20 01:27:00]  End rank: 32,     Out file: /g/data/wb00/admin/testing/weatherbench/5.625deg/2m_temperature/2m_temperature_2011_5.625.nc

[Mon 20 01:27:06]  End rank: 33,     Out file: /g/data/wb00/admin/testing/weatherbench/5.625deg/2m_temperature/2m_temperature_2012_5.625.nc

[Mon 20 01:27:06]  End rank: 23,     Out file: /g/data/wb00/admin/testing/weatherbench/5.625deg/2m_temperature/2m_temperature_2002_5.625.nc

[Mon 20 01:27:09]  End rank: 35,     Out file: /g/data/wb00/admin/testing/weatherbench/5.625deg/2m_temperature/2m_temperature_2014_5.625.nc

[Mon 20 01:27:11]  End rank: 17,     Out file: /g/data/wb00/admin/testing/weatherbench/5.625deg/2m_temperature/2m_temperature_1996_5.625.nc

[Mon 20 01:27:11]  End rank: 38,     Out file: /g/data/wb00/admin/testing/weatherbench/5.625deg/2m_temperature/2m_temperature_2017_5.625.nc

[Mon 20 01:27:11]  End rank: 36,     Out file: /g/data/wb00/admin/testing/weatherbench/5.625deg/2m_temperature/2m_temperature_2015_5.625.nc

[Mon 20 01:27:13]  End rank: 27,     Out file: /g/data/wb00/admin/testing/weatherbench/5.625deg/2m_temperature/2m_temperature_2006_5.625.nc

[Mon 20 01:27:18]  End rank: 37,     Out file: /g/data/wb00/admin/testing/weatherbench/5.625deg/2m_temperature/2m_temperature_2016_5.625.nc

[Mon 20 01:27:22]  End rank: 29,     Out file: /g/data/wb00/admin/testing/weatherbench/5.625deg/2m_temperature/2m_temperature_2008_5.625.nc

[Mon 20 01:27:26]  End rank: 39,     Out file: /g/data/wb00/admin/testing/weatherbench/5.625deg/2m_temperature/2m_temperature_2018_5.625.nc

[Mon 20 01:27:28]  End rank: 15,     Out file: /g/data/wb00/admin/testing/weatherbench/5.625deg/2m_temperature/2m_temperature_1994_5.625.nc

[Mon 20 01:27:54]  End rank: 22,     Out file: /g/data/wb00/admin/testing/weatherbench/5.625deg/2m_temperature/2m_temperature_2001_5.625.nc

[Mon 20 01:29:30]  End rank: 34,     Out file: /g/data/wb00/admin/testing/weatherbench/5.625deg/2m_temperature/2m_temperature_2013_5.625.nc

[Mon 20 01:29:45]  End rank: 19,     Out file: /g/data/wb00/admin/testing/weatherbench/5.625deg/2m_temperature/2m_temperature_1998_5.625.nc

[Mon 20 01:30:24]  End rank: 31,     Out file: /g/data/wb00/admin/testing/weatherbench/5.625deg/2m_temperature/2m_temperature_2010_5.625.nc

[Mon 20 01:32:56]  End rank: 18,     Out file: /g/data/wb00/admin/testing/weatherbench/5.625deg/2m_temperature/2m_temperature_1997_5.625.nc


======================================================================================
                  Resource Usage on 2023-03-20 01:32:59:
   Job Id:             77340287.gadi-pbs
   Project:            fp0
   Exit Status:        0
   Service Units:      457.33
   NCPUs Requested:    480                    NCPUs Used: 480             
                                           CPU Time Used: 14:21:18        
   Memory Requested:   1.86TB                Memory Used: 573.27GB        
   Walltime requested: 02:00:00            Walltime Used: 00:28:35        
   JobFS requested:    200.0GB                JobFS used: 164.04KB        
======================================================================================
