Loading NCI-ai-ml/23.10
  Loading requirement: singularity openmpi/4.1.5
2024-03-21 12:17:00.699187: I tensorflow/core/platform/cpu_feature_guard.cc:182] This TensorFlow binary is optimized to use available CPU instructions in performance-critical operations.
To enable the following instructions: AVX2 AVX512F AVX512_VNNI FMA, in other operations, rebuild TensorFlow with the appropriate compiler flags.
2024-03-21 12:17:10.922691: I tensorflow/core/common_runtime/gpu/gpu_device.cc:1639] Created device /job:localhost/replica:0/task:0/device:GPU:0 with 31141 MB memory:  -> device: 0, name: Tesla V100-SXM2-32GB, pci bus id: 0000:b1:00.0, compute capability: 7.0
Traceback (most recent call last):
  File "/g/data/wb00/admin/testing/NCI_weatherbench/NCI_notebooks_v3/scripts_model_1_4v/3b.cnn-example-5.625_model_1_4v.py", line 131, in <module>
    tp_files   = [ file for year in years for file in glob.glob (fr'{DATADIR}/total_precipitation/*{year}*')   ]
  File "/g/data/wb00/admin/testing/NCI_weatherbench/NCI_notebooks_v3/scripts_model_1_4v/3b.cnn-example-5.625_model_1_4v.py", line 131, in <listcomp>
    tp_files   = [ file for year in years for file in glob.glob (fr'{DATADIR}/total_precipitation/*{year}*')   ]
NameError: name 'DATADIR' is not defined
distributed.nanny - WARNING - Worker process still alive after 3.1999989318847657 seconds, killing
distributed.nanny - WARNING - Worker process still alive after 3.199999389648438 seconds, killing
distributed.nanny - WARNING - Worker process still alive after 3.1999995422363288 seconds, killing
distributed.nanny - WARNING - Worker process still alive after 3.199999389648438 seconds, killing
distributed.nanny - WARNING - Worker process still alive after 3.1999995422363288 seconds, killing
distributed.nanny - WARNING - Worker process still alive after 3.1999995422363288 seconds, killing
distributed.nanny - WARNING - Worker process still alive after 3.1999995422363288 seconds, killing
distributed.nanny - WARNING - Worker process still alive after 3.199999389648438 seconds, killing
distributed.nanny - WARNING - Worker process still alive after 3.1999995422363288 seconds, killing
distributed.nanny - WARNING - Worker process still alive after 3.1999995422363288 seconds, killing
distributed.nanny - WARNING - Worker process still alive after 3.199999694824219 seconds, killing
distributed.nanny - WARNING - Worker process still alive after 3.1999995422363288 seconds, killing
distributed.nanny - WARNING - Worker process still alive after 3.1999992370605472 seconds, killing
distributed.nanny - WARNING - Worker process still alive after 3.199999389648438 seconds, killing
distributed.nanny - WARNING - Worker process still alive after 3.199999389648438 seconds, killing
distributed.nanny - WARNING - Worker process still alive after 3.1999995422363288 seconds, killing
