1973
1973
/g/data/wb00/admin/testing/cds_era5/single-levels/reanalysis/tp/1973
/g/data/wb00/admin/testing/cds_era5/single-levels/reanalysis/tp/1973/tp_era5_oper_sfc_19730101-19730131.nc
/g/data/wb00/admin/testing/cds_era5/single-levels/reanalysis/tp/1973/tp_era5_oper_sfc_19730201-19730228.nc
/g/data/wb00/admin/testing/cds_era5/single-levels/reanalysis/tp/1973/tp_era5_oper_sfc_19730301-19730331.nc
/g/data/wb00/admin/testing/cds_era5/single-levels/reanalysis/tp/1973/tp_era5_oper_sfc_19730401-19730430.nc
/g/data/wb00/admin/testing/cds_era5/single-levels/reanalysis/tp/1973/tp_era5_oper_sfc_19730501-19730531.nc
/g/data/wb00/admin/testing/cds_era5/single-levels/reanalysis/tp/1973/tp_era5_oper_sfc_19730601-19730630.nc
/g/data/wb00/admin/testing/cds_era5/single-levels/reanalysis/tp/1973/tp_era5_oper_sfc_19730701-19730731.nc
/g/data/wb00/admin/testing/cds_era5/single-levels/reanalysis/tp/1973/tp_era5_oper_sfc_19730801-19730831.nc
/g/data/wb00/admin/testing/cds_era5/single-levels/reanalysis/tp/1973/tp_era5_oper_sfc_19730901-19730930.nc
/g/data/wb00/admin/testing/cds_era5/single-levels/reanalysis/tp/1973/tp_era5_oper_sfc_19731001-19731031.nc
/g/data/wb00/admin/testing/cds_era5/single-levels/reanalysis/tp/1973/tp_era5_oper_sfc_19731101-19731130.nc
/g/data/wb00/admin/testing/cds_era5/single-levels/reanalysis/tp/1973/tp_era5_oper_sfc_19731201-19731231.nc

======================================================================================
                  Resource Usage on 2023-05-20 00:22:45:
   Job Id:             84297494.gadi-pbs
   Project:            fp0
   Exit Status:        0
   Service Units:      40.52
   NCPUs Requested:    1                      NCPUs Used: 1               
                                           CPU Time Used: 00:04:32        
   Memory Requested:   15.0GB                Memory Used: 7.46GB          
   Walltime requested: 10:00:00            Walltime Used: 05:24:08        
   JobFS requested:    10.0GB                 JobFS used: 0B              
======================================================================================
