Traceback (most recent call last):
  File "/scratch/fp0/mah900/WeatherBench/pbs_SR_deg/SR_regrid_deg.py", line 44, in <module>
    os.makedirs(out_dir)
  File "/scratch/fp0/mah900/env/weatherbench/lib/python3.10/os.py", line 225, in makedirs
    mkdir(name, mode)
FileExistsError: [Errno 17] File exists: '/g/data/wb00/admin/testing/NCI_weatherbench/2.8125deg/2m_temperature'
