1979
1979
/g/data/wb00/admin/testing/cds_era5/single-levels/reanalysis/tisr/1979
/g/data/wb00/admin/testing/cds_era5/single-levels/reanalysis/tisr/1979/tisr_era5_oper_sfc_19790101-19790131.nc
/g/data/wb00/admin/testing/cds_era5/single-levels/reanalysis/tisr/1979/tisr_era5_oper_sfc_19790201-19790228.nc
/g/data/wb00/admin/testing/cds_era5/single-levels/reanalysis/tisr/1979/tisr_era5_oper_sfc_19790301-19790331.nc
/g/data/wb00/admin/testing/cds_era5/single-levels/reanalysis/tisr/1979/tisr_era5_oper_sfc_19790401-19790430.nc
/g/data/wb00/admin/testing/cds_era5/single-levels/reanalysis/tisr/1979/tisr_era5_oper_sfc_19790501-19790531.nc
/g/data/wb00/admin/testing/cds_era5/single-levels/reanalysis/tisr/1979/tisr_era5_oper_sfc_19790601-19790630.nc
/g/data/wb00/admin/testing/cds_era5/single-levels/reanalysis/tisr/1979/tisr_era5_oper_sfc_19790701-19790731.nc
/g/data/wb00/admin/testing/cds_era5/single-levels/reanalysis/tisr/1979/tisr_era5_oper_sfc_19790801-19790831.nc
/g/data/wb00/admin/testing/cds_era5/single-levels/reanalysis/tisr/1979/tisr_era5_oper_sfc_19790901-19790930.nc
/g/data/wb00/admin/testing/cds_era5/single-levels/reanalysis/tisr/1979/tisr_era5_oper_sfc_19791001-19791031.nc
/g/data/wb00/admin/testing/cds_era5/single-levels/reanalysis/tisr/1979/tisr_era5_oper_sfc_19791101-19791130.nc
/g/data/wb00/admin/testing/cds_era5/single-levels/reanalysis/tisr/1979/tisr_era5_oper_sfc_19791201-19791231.nc

======================================================================================
                  Resource Usage on 2023-05-19 01:22:13:
   Job Id:             84184690.gadi-pbs
   Project:            fp0
   Exit Status:        0
   Service Units:      2.77
   NCPUs Requested:    1                      NCPUs Used: 1               
                                           CPU Time Used: 00:04:16        
   Memory Requested:   10.0GB                Memory Used: 8.92GB          
   Walltime requested: 10:00:00            Walltime Used: 00:33:17        
   JobFS requested:    10.0GB                 JobFS used: 0B              
======================================================================================
