1961
1961
/g/data/wb00/admin/testing/cds_era5/single-levels/reanalysis/tp/1961
/g/data/wb00/admin/testing/cds_era5/single-levels/reanalysis/tp/1961/tp_era5_oper_sfc_19610101-19610131.nc
/g/data/wb00/admin/testing/cds_era5/single-levels/reanalysis/tp/1961/tp_era5_oper_sfc_19610201-19610228.nc
/g/data/wb00/admin/testing/cds_era5/single-levels/reanalysis/tp/1961/tp_era5_oper_sfc_19610301-19610331.nc
/g/data/wb00/admin/testing/cds_era5/single-levels/reanalysis/tp/1961/tp_era5_oper_sfc_19610401-19610430.nc
/g/data/wb00/admin/testing/cds_era5/single-levels/reanalysis/tp/1961/tp_era5_oper_sfc_19610501-19610531.nc
/g/data/wb00/admin/testing/cds_era5/single-levels/reanalysis/tp/1961/tp_era5_oper_sfc_19610601-19610630.nc
/g/data/wb00/admin/testing/cds_era5/single-levels/reanalysis/tp/1961/tp_era5_oper_sfc_19610701-19610731.nc
/g/data/wb00/admin/testing/cds_era5/single-levels/reanalysis/tp/1961/tp_era5_oper_sfc_19610801-19610831.nc
/g/data/wb00/admin/testing/cds_era5/single-levels/reanalysis/tp/1961/tp_era5_oper_sfc_19610901-19610930.nc
/g/data/wb00/admin/testing/cds_era5/single-levels/reanalysis/tp/1961/tp_era5_oper_sfc_19611001-19611031.nc
/g/data/wb00/admin/testing/cds_era5/single-levels/reanalysis/tp/1961/tp_era5_oper_sfc_19611101-19611130.nc
/g/data/wb00/admin/testing/cds_era5/single-levels/reanalysis/tp/1961/tp_era5_oper_sfc_19611201-19611231.nc

======================================================================================
                  Resource Usage on 2023-05-20 00:05:23:
   Job Id:             84297334.gadi-pbs
   Project:            fp0
   Exit Status:        0
   Service Units:      38.48
   NCPUs Requested:    1                      NCPUs Used: 1               
                                           CPU Time Used: 00:04:08        
   Memory Requested:   15.0GB                Memory Used: 2.75GB          
   Walltime requested: 10:00:00            Walltime Used: 05:07:51        
   JobFS requested:    10.0GB                 JobFS used: 0B              
======================================================================================
