touch: setting times of '/scratch/fp0/mah900/FourCastNet/FourCastNet_Fig/.ipynb_checkpoints/.file': Permission denied
touch: setting times of '/scratch/fp0/mah900/FourCastNet/.git/refs/tags/.file': Permission denied
touch: setting times of '/scratch/fp0/mah900/FourCastNet/.git/branches/.file': Permission denied
touch: setting times of '/scratch/fp0/mah900/FourCastNet/.git/objects/info/.file': Permission denied
touch: setting times of '/scratch/fp0/mah900/FourCastNet/FourCastNet_Fig/.ipynb_checkpoints/.file': Permission denied
find: '/scratch/fp0/mah900/deepspeech/DeepSpeech/native_client/swift/deepspeech_ios_test/Preview': No such file or directory
find: 'Content': No such file or directory
find: '/scratch/fp0/mah900/deepspeech/DeepSpeech/native_client/swift/deepspeech_ios_test/Preview': No such file or directory
find: 'Content/Preview': No such file or directory
find: 'Assets.xcassets': No such file or directory
touch: setting times of '/scratch/fp0/mah900/polar-modelling-icenet/icenet/-f/.file': Permission denied
touch: setting times of '/scratch/fp0/mah900/polar-modelling-icenet/icenet/-f/.file': Permission denied
touch: setting times of '/scratch/fp0/mah900/polar-modelling-icenet/icenet/-f/.file': Permission denied
touch: setting times of '/scratch/fp0/mah900/polar-modelling-icenet/.git/refs/tags/.file': Permission denied
touch: setting times of '/scratch/fp0/mah900/polar-modelling-icenet/.git/branches/.file': Permission denied
touch: setting times of '/scratch/fp0/mah900/polar-modelling-icenet/.git/objects/info/.file': Permission denied
touch: setting times of '/scratch/fp0/mah900/polar-modelling-icenet/.ipynb_checkpoints/.file': Permission denied
/local/spool/pbs/mom_priv/jobs/78384571.gadi-pbs.SC: line 1: kill: (-1238298) - No such process
