touch: setting times of '/scratch/fp0/shared/MNIST': Permission denied
touch: setting times of '/scratch/fp0/shared/MNIST/raw': Permission denied
touch: setting times of '/scratch/fp0/shared/MNIST/raw/t10k-labels-idx1-ubyte': Permission denied
touch: setting times of '/scratch/fp0/shared/MNIST/raw/t10k-labels-idx1-ubyte.gz': Permission denied
touch: setting times of '/scratch/fp0/shared/MNIST/raw/train-labels-idx1-ubyte.gz': Permission denied
touch: setting times of '/scratch/fp0/shared/MNIST/raw/train-images-idx3-ubyte': Permission denied
touch: setting times of '/scratch/fp0/shared/MNIST/raw/train-images-idx3-ubyte.gz': Permission denied
touch: setting times of '/scratch/fp0/shared/MNIST/raw/t10k-images-idx3-ubyte': Permission denied
touch: setting times of '/scratch/fp0/shared/MNIST/raw/t10k-images-idx3-ubyte.gz': Permission denied
touch: setting times of '/scratch/fp0/shared/MNIST/raw/train-labels-idx1-ubyte': Permission denied
touch: setting times of '/scratch/fp0/shared/MNIST/raw': Permission denied
touch: setting times of '/scratch/fp0/shared/MNIST/raw/t10k-labels-idx1-ubyte': Permission denied
touch: setting times of '/scratch/fp0/shared/MNIST/raw/t10k-labels-idx1-ubyte.gz': Permission denied
touch: setting times of '/scratch/fp0/shared/MNIST/raw/train-labels-idx1-ubyte.gz': Permission denied
touch: setting times of '/scratch/fp0/shared/MNIST/raw/train-images-idx3-ubyte': Permission denied
touch: setting times of '/scratch/fp0/shared/MNIST/raw/train-images-idx3-ubyte.gz': Permission denied
touch: setting times of '/scratch/fp0/shared/MNIST/raw/t10k-images-idx3-ubyte': Permission denied
touch: setting times of '/scratch/fp0/shared/MNIST/raw/t10k-images-idx3-ubyte.gz': Permission denied
touch: setting times of '/scratch/fp0/shared/MNIST/raw/train-labels-idx1-ubyte': Permission denied
touch: setting times of '/scratch/fp0/shared/phdf5-py': Permission denied
touch: setting times of '/scratch/fp0/shared/phdf5-py/mpi4py_trivial.py': Permission denied
touch: setting times of '/scratch/fp0/shared/phdf5-py/parallel_hdf5_original.py': Permission denied
touch: setting times of '/scratch/fp0/shared/sis_720': Permission denied
touch: setting times of '/scratch/fp0/shared/sis_720/INPUT': Permission denied
/local/spool/pbs/mom_priv/jobs/57518819.gadi-pbs.SC: line 1: kill: (-3157708) - No such process
touch: setting times of '/scratch/fp0/shared/sis_720/INPUT': Permission denied
