find: '/scratch/fp0/mah900/deepspeech/DeepSpeech/native_client/swift/deepspeech_ios_test/Preview': No such file or directory
find: 'Content': No such file or directory
find: '/scratch/fp0/mah900/deepspeech/DeepSpeech/native_client/swift/deepspeech_ios_test/Preview': No such file or directory
find: 'Content/Preview': No such file or directory
find: 'Assets.xcassets': No such file or directory
/local/spool/pbs/mom_priv/jobs/89022596.gadi-pbs.SC: line 1: kill: (-2002490) - No such process
