//*************************
// Beispiel 2
//*************************
Dimension 2,3,1
[2,3,1] Teil 6:  0 4 0 0 1 0
[1,3,1] Teil 2:  0 1 2 0 0 0
[2,2,1] Teil 3:  0 1 0 3 4 0
[1,2,1] Teil 4:  0 4 3 2 0 0
[2,1,1] Teil 5:  0 0 0 2 4 0
[1,1,1] Teil 1:  0 0 3 3 0 0
