//************************
// Dimension 0
//************************
Dimension 0,2,2
Teil 1: 4 4 2 0 0 0
Teil 2: 3 4 1 0 0 0
Teil 3: 3 2 3 0 0 0
Teil 4: 1 4 4 0 0 0
Teil 5: 1 4 1 0 0 0
Teil 6: 3 3 1 0 0 0
Teil 7: 3 4 2 0 0 0
Teil 8: 3 2 2 0 0 0
