<svg xmlns="http://www.w3.org/2000/svg" width="25" height="24" viewBox="0 0 25 24" fill="none">
  <g clip-path="url(#clip0_52_514)">
    <path d="M23.266 4.56612C22.9006 4.41391 22.4981 4.3739 22.1099 4.45119C21.7217 4.52848 21.3653 4.71957 21.086 5.00012L18.5 7.58612L13.914 3.00012C13.5389 2.62518 13.0303 2.41455 12.5 2.41455C11.9697 2.41455 11.4611 2.62518 11.086 3.00012L6.5 7.58612L3.914 5.00012C3.6343 4.7205 3.27797 4.53009 2.89006 4.45296C2.50216 4.37582 2.10009 4.41543 1.73469 4.56677C1.36929 4.71811 1.05697 4.97439 0.837197 5.30321C0.617428 5.63203 0.500084 6.01862 0.5 6.41412V17.0001C0.501588 18.3257 1.02888 19.5966 1.96622 20.5339C2.90356 21.4712 4.17441 21.9985 5.5 22.0001H19.5C20.8256 21.9985 22.0964 21.4712 23.0338 20.5339C23.9711 19.5966 24.4984 18.3257 24.5 17.0001V6.41412C24.5001 6.01859 24.3829 5.63191 24.1633 5.30297C23.9436 4.97404 23.6314 4.71761 23.266 4.56612ZM22.5 17.0001C22.5 17.7958 22.1839 18.5588 21.6213 19.1214C21.0587 19.6841 20.2956 20.0001 19.5 20.0001H5.5C4.70435 20.0001 3.94129 19.6841 3.37868 19.1214C2.81607 18.5588 2.5 17.7958 2.5 17.0001V6.41412L5.793 9.70712C5.98053 9.89459 6.23484 9.99991 6.5 9.99991C6.76516 9.99991 7.01947 9.89459 7.207 9.70712L12.5 4.41412L17.793 9.70712C17.9805 9.89459 18.2348 9.99991 18.5 9.99991C18.7652 9.99991 19.0195 9.89459 19.207 9.70712L22.5 6.41412V17.0001Z"/>
  </g>
  <defs>
    <clipPath id="clip0_52_514">
      <rect width="24" height="24" fill="white" transform="translate(0.5)"/>
    </clipPath>
  </defs>
</svg>