{
	"info": {
		"_postman_id": "ef569bc1-c16a-4c31-b67a-e55a0b5948cd",
		"name": "S31",
		"schema": "https://schema.getpostman.com/json/collection/v2.1.0/collection.json",
		"_exporter_id": "21500827"
	},
	"item": [
		{
			"name": "Get all tasks",
			"request": {
				"method": "GET",
				"header": [],
				"url": {
					"raw": "localhost:3001/task",
					"host": [
						"localhost"
					],
					"port": "3001",
					"path": [
						"task"
					]
				}
			},
			"response": []
		},
		{
			"name": "Create a task",
			"request": {
				"method": "POST",
				"header": [],
				"body": {
					"mode": "raw",
					"raw": "{\r\n    \"name\": \"Dummy\"\r\n}",
					"options": {
						"raw": {
							"language": "json"
						}
					}
				},
				"url": {
					"raw": "localhost:3001/task",
					"host": [
						"localhost"
					],
					"port": "3001",
					"path": [
						"task"
					]
				}
			},
			"response": []
		},
		{
			"name": "Delete a Task",
			"request": {
				"method": "DELETE",
				"header": [],
				"url": {
					"raw": "localhost:3001/task/62b58e326e99bd31e36a5426",
					"host": [
						"localhost"
					],
					"port": "3001",
					"path": [
						"task",
						"62b58e326e99bd31e36a5426"
					]
				}
			},
			"response": []
		},
		{
			"name": "Update a Task",
			"request": {
				"method": "PATCH",
				"header": [],
				"body": {
					"mode": "raw",
					"raw": "{\r\n    \"name\": \"Updated\"\r\n}",
					"options": {
						"raw": {
							"language": "json"
						}
					}
				},
				"url": {
					"raw": "localhost:3001/task/62b31027d7bc182f77aec67d",
					"host": [
						"localhost"
					],
					"port": "3001",
					"path": [
						"task",
						"62b31027d7bc182f77aec67d"
					]
				}
			},
			"response": []
		},
		{
			"name": "Update complete a task",
			"request": {
				"method": "PUT",
				"header": [],
				"url": {
					"raw": "localhost:3001/task/62b31049d7bc182f77aec681/complete",
					"host": [
						"localhost"
					],
					"port": "3001",
					"path": [
						"task",
						"62b31049d7bc182f77aec681",
						"complete"
					]
				}
			},
			"response": []
		},
		{
			"name": "Get one Task",
			"request": {
				"method": "GET",
				"header": [],
				"url": {
					"raw": "localhost:3001/task/62b31049d7bc182f77aec681",
					"host": [
						"localhost"
					],
					"port": "3001",
					"path": [
						"task",
						"62b31049d7bc182f77aec681"
					]
				}
			},
			"response": []
		}
	]
}