{
	"info": {
		"_postman_id": "31c07116-bc14-4538-821c-992732797ef0",
		"name": "S27",
		"schema": "https://schema.getpostman.com/json/collection/v2.1.0/collection.json",
		"_exporter_id": "21500827"
	},
	"item": [
		{
			"name": "d1",
			"item": [
				{
					"name": "GET Test",
					"request": {
						"method": "GET",
						"header": [],
						"url": {
							"raw": "localhost:4000/items",
							"host": [
								"localhost"
							],
							"port": "4000",
							"path": [
								"items"
							]
						}
					},
					"response": []
				},
				{
					"name": "POST Test",
					"request": {
						"method": "POST",
						"header": [],
						"url": {
							"raw": "localhost:4000/items",
							"host": [
								"localhost"
							],
							"port": "4000",
							"path": [
								"items"
							]
						}
					},
					"response": []
				},
				{
					"name": "Retrieve Users",
					"request": {
						"method": "GET",
						"header": [],
						"url": {
							"raw": "localhost:4000/users",
							"host": [
								"localhost"
							],
							"port": "4000",
							"path": [
								"users"
							]
						}
					},
					"response": []
				},
				{
					"name": "Create a User",
					"request": {
						"method": "POST",
						"header": [],
						"body": {
							"mode": "raw",
							"raw": "{\r\n    \"name\": \"Brandon\",\r\n    \"email\": \"john@mail.com\"\r\n}",
							"options": {
								"raw": {
									"language": "json"
								}
							}
						},
						"url": {
							"raw": "localhost:4000/users",
							"host": [
								"localhost"
							],
							"port": "4000",
							"path": [
								"users"
							]
						}
					},
					"response": []
				},
				{
					"name": "Update a User",
					"request": {
						"method": "PUT",
						"header": [],
						"body": {
							"mode": "raw",
							"raw": "{\r\n    \"name\": \"Brandon\",\r\n    \"email\": \"brandon@mail.com\"\r\n}",
							"options": {
								"raw": {
									"language": "json"
								}
							}
						},
						"url": {
							"raw": "localhost:4000/users",
							"host": [
								"localhost"
							],
							"port": "4000",
							"path": [
								"users"
							]
						}
					},
					"response": []
				}
			]
		},
		{
			"name": "a1",
			"item": [
				{
					"name": "Homepage GET route",
					"request": {
						"method": "GET",
						"header": [],
						"url": {
							"raw": "localhost:4000",
							"host": [
								"localhost"
							],
							"port": "4000"
						}
					},
					"response": []
				},
				{
					"name": "Profile GET route",
					"request": {
						"method": "GET",
						"header": [],
						"url": {
							"raw": "localhost:4000/profile",
							"host": [
								"localhost"
							],
							"port": "4000",
							"path": [
								"profile"
							]
						}
					},
					"response": []
				},
				{
					"name": "Course GET route",
					"request": {
						"method": "GET",
						"header": [],
						"url": {
							"raw": "localhost:4000/courses",
							"host": [
								"localhost"
							],
							"port": "4000",
							"path": [
								"courses"
							]
						}
					},
					"response": []
				},
				{
					"name": "Course POST route",
					"request": {
						"method": "POST",
						"header": [],
						"url": {
							"raw": "localhost:4000/addCourse",
							"host": [
								"localhost"
							],
							"port": "4000",
							"path": [
								"addCourse"
							]
						}
					},
					"response": []
				},
				{
					"name": "Course PUT route",
					"request": {
						"method": "PUT",
						"header": [],
						"url": {
							"raw": "localhost:4000/updateCourse",
							"host": [
								"localhost"
							],
							"port": "4000",
							"path": [
								"updateCourse"
							]
						}
					},
					"response": []
				},
				{
					"name": "Course DELETE route",
					"request": {
						"method": "DELETE",
						"header": [],
						"url": {
							"raw": "localhost:4000/archiveCourse",
							"host": [
								"localhost"
							],
							"port": "4000",
							"path": [
								"archiveCourse"
							]
						}
					},
					"response": []
				}
			]
		}
	]
}