{
	"info": {
		"_postman_id": "8f890f71-a17c-4c30-ae32-631149420d62",
		"name": "s29",
		"schema": "https://schema.getpostman.com/json/collection/v2.1.0/collection.json",
		"_exporter_id": "20772040"
	},
	"item": [
		{
			"name": "d1",
			"item": [
				{
					"name": "POST request in the /hello endpoint",
					"request": {
						"method": "POST",
						"header": [],
						"body": {
							"mode": "raw",
							"raw": "{\r\n    \"firstName\": \"John\",\r\n    \"lastName\": \"Doe\"\r\n}",
							"options": {
								"raw": {
									"language": "json"
								}
							}
						},
						"url": {
							"raw": "localhost:3000/hello",
							"host": [
								"localhost"
							],
							"port": "3000",
							"path": [
								"hello"
							]
						}
					},
					"response": []
				},
				{
					"name": "home",
					"request": {
						"method": "GET",
						"header": []
					},
					"response": []
				},
				{
					"name": "add user",
					"request": {
						"method": "POST",
						"header": [],
						"body": {
							"mode": "raw",
							"raw": "{\r\n    \"userName\": \"johndoe\",\r\n    \"password\": \"john123\"\r\n}",
							"options": {
								"raw": {
									"language": "json"
								}
							}
						},
						"url": {
							"raw": "localhost:3000/signup",
							"host": [
								"localhost"
							],
							"port": "3000",
							"path": [
								"signup"
							]
						}
					},
					"response": []
				},
				{
					"name": "get user",
					"request": {
						"method": "GET",
						"header": []
					},
					"response": []
				},
				{
					"name": "change password",
					"request": {
						"method": "GET",
						"header": []
					},
					"response": []
				},
				{
					"name": "delete user",
					"request": {
						"method": "GET",
						"header": []
					},
					"response": []
				}
			]
		}
	]
}