{
	"info": {
		"_postman_id": "6fc579ef-fb06-4bdf-9054-28505d937271",
		"name": "s29",
		"schema": "https://schema.getpostman.com/json/collection/v2.1.0/collection.json",
		"_exporter_id": "21298979"
	},
	"item": [
		{
			"name": "d1",
			"item": [
				{
					"name": "GET home",
					"request": {
						"method": "GET",
						"header": [],
						"url": {
							"raw": "localhost:3000/home",
							"host": [
								"localhost"
							],
							"port": "3000",
							"path": [
								"home"
							]
						}
					},
					"response": []
				},
				{
					"name": "DELETE user",
					"request": {
						"method": "DELETE",
						"header": [],
						"body": {
							"mode": "raw",
							"raw": "{\r\n        \"userName\": \"janedoe\"\r\n}",
							"options": {
								"raw": {
									"language": "json"
								}
							}
						},
						"url": {
							"raw": "localhost:3000/delete-user",
							"host": [
								"localhost"
							],
							"port": "3000",
							"path": [
								"delete-user"
							]
						}
					},
					"response": []
				},
				{
					"name": "POST signup",
					"request": {
						"method": "POST",
						"header": [],
						"body": {
							"mode": "raw",
							"raw": "{\r\n    \"userName\": \"johndoe\",\r\n\t\"password\": \"john123\"\r\n}\r\n",
							"options": {
								"raw": {
									"language": "json"
								}
							}
						},
						"url": {
							"raw": "localhost:3000/signup",
							"host": [
								"localhost"
							],
							"port": "3000",
							"path": [
								"signup"
							]
						}
					},
					"response": []
				},
				{
					"name": "GET users",
					"request": {
						"method": "GET",
						"header": [],
						"url": {
							"raw": "localhost:3000/users",
							"host": [
								"localhost"
							],
							"port": "3000",
							"path": [
								"users"
							]
						}
					},
					"response": []
				}
			]
		}
	]
}