{
	"info": {
		"_postman_id": "f3981853-108a-4cd3-ab3b-bba85d2098a1",
		"name": "session32-activity",
		"schema": "https://schema.getpostman.com/json/collection/v2.1.0/collection.json",
		"_exporter_id": "21154117"
	},
	"item": [
		{
			"name": "GET Items",
			"request": {
				"method": "GET",
				"header": [],
				"url": {
					"raw": "localhost:8000/items",
					"host": [
						"localhost"
					],
					"port": "8000",
					"path": [
						"items"
					]
				}
			},
			"response": []
		},
		{
			"name": "ADD Item",
			"request": {
				"method": "POST",
				"header": [],
				"body": {
					"mode": "raw",
					"raw": "{\r\n    \"name\" : \"Logitech G733\",\r\n    \"price\" : 7000,\r\n    \"isActive\" : true\r\n}",
					"options": {
						"raw": {
							"language": "json"
						}
					}
				},
				"url": {
					"raw": "localhost:8000/items",
					"host": [
						"localhost"
					],
					"port": "8000",
					"path": [
						"items"
					]
				}
			},
			"response": []
		},
		{
			"name": "DELETE Item",
			"request": {
				"method": "DELETE",
				"header": [],
				"url": {
					"raw": "localhost:8000/items",
					"host": [
						"localhost"
					],
					"port": "8000",
					"path": [
						"items"
					]
				}
			},
			"response": []
		}
	]
}