[{"name":"Eggbract Sedge","description":"Tympanosclerosis, bilateral","price":"$4.58"},
{"name":"Rock Elm","description":"Pasngr on bus injured in clsn w nonmtr vehicle nontraf, subs","price":"$6.39"},
{"name":"Cup Lichen","description":"Other venous complications in the puerperium","price":"$1.92"},
{"name":"Sea Torchwood","description":"Unsp subluxation of unspecified wrist and hand, init encntr","price":"$7.17"},
{"name":"Narrowleaf Gumweed","description":"Type 2 diabetes w unsp diabetic rtnop w/o macular edema","price":"$8.69"},
{"name":"Ribbonleaf Pondweed","description":"Unspecified injury of left Achilles tendon, sequela","price":"$2.47"},
{"name":"Sand Pygmyweed","description":"Displ oblique fx shaft of humer, right arm, init for opn fx","price":"$2.07"},
{"name":"Serpentine Springbeauty","description":"Oth complication of genitourinary prosth dev/grft, sequela","price":"$6.90"},
{"name":"Lescur's Platylomella Moss","description":"Disp fx of neck of second MC bone, left hand, sequela","price":"$7.93"},
{"name":"Shortleaf Stopper","description":"Displ bicondylar fx r tibia, 7thJ","price":"$9.54"}]