,words,frequency
0,far,112
1,wife,52
2,old,260
3,love,413
4,price,320
5,worth,117
6,buy,264
7,use,718
8,install,44
9,get,564
10,stream,44
11,almost,72
12,everything,108
13,awesome,46
14,kindle,212
15,easy,453
16,clear,33
17,break,18
18,nice,151
19,product,323
20,know,141
21,able,207
22,live,22
23,without,144
24,great,705
25,liked,43
26,bought,521
27,one,583
28,looking,134
29,something,123
30,want,210
31,go,125
32,computer,28
33,battery,150
34,life,86
35,enough,99
36,daily,19
37,operating,22
38,limited,67
39,downloading,26
40,apps,357
41,screen,301
42,resolution,46
43,got,266
44,room,32
45,along,24
46,sound,113
47,quality,178
48,bluetooth,13
49,speaker,78
50,asking,36
51,music,186
52,year,202
53,read,302
54,add,64
55,may,68
56,age,14
57,streaming,100
58,little,247
59,setup,46
60,expensive,46
61,sister,8
62,said,56
63,happy,106
64,even,218
65,especially,58
66,like,635
67,tell,55
68,shopping,39
69,news,28
70,briefing,2
71,best,167
72,route,3
73,easier,62
74,first,207
75,perfectly,15
76,new,215
77,recommend,220
78,anyone,50
79,spend,52
80,lighting,24
81,bit,87
82,overall,42
83,package,5
84,otherwise,16
85,excellent,46
86,really,301
87,interface,29
88,pick,23
89,wish,87
90,getting,108
91,device,251
92,set,186
93,taking,30
94,worked,55
95,downloaded,34
96,onto,16
97,following,5
98,youtube,10
99,patience,3
100,service,36
101,amount,24
102,free,115
103,offered,14
104,via,35
105,cable,75
106,satellite,3
107,perfect,105
108,built,31
109,smart,81
110,replace,62
111,existing,9
112,opinion,13
113,amazing,36
114,daughter,117
115,tried,72
116,also,219
117,several,83
118,box,79
119,higher,26
120,fantastic,15
121,value,41
122,wanting,13
123,start,34
124,small,103
125,size,112
126,pretty,108
127,well,192
128,made,66
129,fan,22
130,trying,58
131,lot,184
132,easily,45
133,basic,90
134,gift,162
135,every,118
136,thing,124
137,need,161
138,fun,76
139,kid,59
140,improvement,11
141,big,69
142,simple,77
143,design,12
144,recommended,13
145,purchase,138
146,second,63
147,carry,35
148,around,84
149,could,207
150,knew,15
151,nothing,55
152,info,14
153,look,59
154,app,185
155,access,70
156,complaint,16
157,consistently,3
158,plugged,25
159,would,592
160,long,103
161,allow,31
162,us,36
163,place,20
164,much,334
165,family,72
166,reading,240
167,better,237
168,going,85
169,extra,70
170,cost,38
171,regret,9
172,fast,89
173,many,178
174,cheaper,29
175,buying,63
176,brother,8
177,try,42
178,hard,82
179,believe,15
180,opened,12
181,content,52
182,definitely,73
183,must,47
184,money,93
185,rated,2
186,purchased,267
187,work,238
188,deal,51
189,barely,13
190,watch,144
191,anymore,5
192,tv,109
193,network,12
194,single,7
195,night,30
196,since,113
197,near,8
198,intuitive,9
199,option,41
200,learn,43
201,point,30
202,time,268
203,though,62
204,memory,71
205,card,72
206,expand,16
207,storage,40
208,granddaughter,31
209,started,44
210,foreign,3
211,ability,30
212,favorite,30
213,plus,22
214,always,87
215,disappointed,56
216,reader,45
217,picture,42
218,number,24
219,choose,20
220,learned,9
221,comparison,8
222,low,58
223,careful,12
224,load,54
225,powered,8
226,display,48
227,using,189
228,friendly,42
229,help,48
230,online,49
231,support,31
232,nephew,14
233,budget,16
234,needed,64
235,fit,33
236,make,136
237,difficult,40
238,press,14
239,button,27
240,rather,37
241,saying,16
242,pay,115
243,choice,20
244,basis,4
245,play,286
246,supposed,19
247,travel,28
248,type,23
249,bigger,26
250,touch,53
251,still,198
252,control,73
253,truly,12
254,song,13
255,turn,119
256,improved,6
257,previously,14
258,owned,23
259,generation,39
260,numerous,14
261,response,22
262,husband,33
263,son,119
264,fire,205
265,top,33
266,pleased,31
267,capable,13
268,two,114
269,parental,39
270,operate,17
271,thinking,23
272,purchasing,31
273,remember,15
274,came,58
275,whole,37
276,technology,27
277,mostly,33
278,listening,27
279,internet,87
280,addition,19
281,take,130
282,working,70
283,surprised,11
284,glad,24
285,paid,44
286,step,13
287,suggested,4
288,large,20
289,extremely,40
290,decided,54
291,received,27
292,last,68
293,month,29
294,gave,46
295,game,39
296,thought,94
297,bug,2
298,appear,8
299,initially,6
300,micro,16
301,sd,22
302,think,117
303,available,86
304,used,193
305,download,124
306,book,82
307,ereader,15
308,find,144
309,already,72
310,another,98
311,order,54
312,stick,52
313,someone,45
314,alexa,11
315,handy,10
316,phone,101
317,send,16
318,feel,46
319,become,14
320,home,145
321,trial,8
322,error,5
323,five,11
324,star,16
325,review,26
326,say,100
327,sure,103
328,member,27
329,birthday,19
330,wrong,21
331,enjoy,70
332,stop,20
333,loved,61
334,echo,105
335,dot,22
336,ago,17
337,prefer,38
338,playing,89
339,watching,67
340,present,20
341,learning,53
342,house,32
343,back,168
344,anything,87
345,minimal,8
346,call,19
347,ask,98
348,weather,43
349,stuff,36
350,constant,8
351,blue,10
352,feature,44
353,color,24
354,change,34
355,user,80
356,asked,24
357,information,32
358,actually,52
359,gadget,7
360,guy,7
361,keep,77
362,provides,16
363,public,4
364,imagine,8
365,upgrade,23
366,internal,12
367,process,17
368,opening,11
369,page,63
370,way,143
371,hold,50
372,certain,25
373,angle,3
374,bottom,14
375,see,112
376,took,65
377,exchanged,14
378,model,41
379,except,19
380,appears,14
381,behind,7
382,likely,8
383,reduced,4
384,compared,33
385,seriously,8
386,whether,12
387,everyone,22
388,inexpensive,30
389,ran,11
390,similar,17
391,adding,15
392,listen,46
393,larger,34
394,previous,41
395,voice,85
396,cord,31
397,apple,30
398,exactly,33
399,wanted,107
400,beyond,8
401,give,75
402,slow,131
403,never,85
404,library,31
405,different,71
406,loaded,16
407,kodi,6
408,absolutely,49
409,let,32
410,ordered,22
411,else,37
412,day,65
413,replacement,36
414,market,22
415,right,76
416,mine,32
417,others,17
418,item,94
419,couple,53
420,bad,54
421,replaced,23
422,portable,13
423,hook,11
424,fact,52
425,android,58
426,credit,20
427,found,84
428,confusing,12
429,answer,68
430,push,9
431,smaller,32
432,tech,38
433,faster,65
434,front,16
435,fairly,15
436,performance,43
437,adult,11
438,level,20
439,people,36
440,charge,102
441,child,57
442,fully,13
443,linked,13
444,prime,59
445,allows,24
446,thru,10
447,black,57
448,seen,16
449,finding,14
450,quite,44
451,eventually,9
452,camera,37
453,figured,22
454,seem,43
455,useful,38
456,later,23
457,audio,15
458,loses,5
459,cool,27
460,highly,39
461,primarily,11
462,talking,13
463,respond,13
464,turning,27
465,seems,76
466,problem,72
467,piece,14
468,mom,22
469,profile,10
470,mainly,24
471,wait,28
472,link,10
473,mobile,9
474,unlimited,14
475,hulu,6
476,netflix,12
477,subscription,25
478,pocket,3
479,main,28
480,reason,43
481,installed,14
482,however,36
483,realize,18
484,come,50
485,alarm,10
486,function,16
487,wake,10
488,third,19
489,mother,31
490,longer,43
491,charging,69
492,properly,12
493,decent,63
494,space,20
495,super,28
496,ended,31
497,seemed,15
498,inappropriate,3
499,charged,20
500,account,44
501,stopping,3
502,paper,37
503,white,38
504,throw,8
505,purse,15
506,chance,12
507,outside,29
508,ever,48
509,high,33
510,assistant,3
511,told,37
512,older,55
513,version,60
514,case,66
515,power,46
516,early,6
517,programming,9
518,paying,21
519,cell,12
520,ease,30
521,impressive,6
522,nearly,13
523,various,12
524,put,92
525,ridiculous,3
526,sadly,2
527,due,34
528,understand,59
529,ton,8
530,light,129
531,run,38
532,handle,21
533,trouble,18
534,hand,21
535,heavy,20
536,powerful,13
537,view,18
538,please,6
539,requires,11
540,external,11
541,check,30
542,sitting,6
543,everywhere,9
544,died,12
545,quick,24
546,idea,18
547,firetv,10
548,plug,36
549,capability,5
550,wifi,67
551,additional,24
552,fee,8
553,true,6
554,beginning,10
555,excited,24
556,flight,3
557,durable,9
558,young,33
559,slower,19
560,interested,9
561,part,23
562,radio,23
563,paperwhite,33
564,tap,8
565,purple,3
566,cover,66
567,safe,7
568,upload,7
569,broken,11
570,geek,11
571,self,7
572,expected,27
573,yr,35
574,job,26
575,done,29
576,began,6
577,source,12
578,suppose,9
579,thats,8
580,full,54
581,cant,22
582,bright,22
583,grandson,24
584,evening,6
585,monthly,7
586,originally,9
587,list,34
588,beginner,21
589,real,31
590,might,33
591,friend,19
592,cause,15
593,channel,11
594,connection,45
595,name,22
596,difference,30
597,receiving,6
598,away,25
599,yet,35
600,countless,4
601,personally,6
602,past,25
603,completely,21
604,cancelled,4
605,program,11
606,went,57
607,buffering,16
608,kinda,11
609,basically,22
610,store,116
611,miss,16
612,major,14
613,build,18
614,representative,4
615,hooked,13
616,directly,10
617,charger,90
618,anywhere,13
619,law,13
620,figure,39
621,amp,5
622,mind,20
623,speed,40
624,shield,4
625,update,26
626,today,11
627,probably,48
628,connected,44
629,often,28
630,end,39
631,firestick,10
632,click,11
633,ethernet,3
634,bang,11
635,membership,8
636,pdf,8
637,format,7
638,open,31
639,tied,8
640,responds,13
641,sale,46
642,damaged,6
643,normal,11
644,chose,11
645,satisfied,21
646,pressure,5
647,given,27
648,word,11
649,expect,55
650,navigate,28
651,difficulty,7
652,three,35
653,reliable,14
654,grandchild,4
655,fine,70
656,connecting,7
657,dont,20
658,plane,7
659,remote,69
660,called,23
661,fixed,9
662,particular,12
663,solid,19
664,obviously,7
665,connect,74
666,added,27
667,specific,19
668,edition,7
669,returning,52
670,kept,22
671,least,33
672,couldnt,5
673,quickly,21
674,gotten,10
675,freezing,9
676,save,18
677,instead,52
678,ideal,3
679,half,35
680,dropped,19
681,voyage,4
682,setting,33
683,freeze,20
684,move,11
685,brought,22
686,sometimes,59
687,mean,7
688,toy,12
689,ok,66
690,anyway,2
691,absolute,5
692,guess,33
693,surf,21
694,provide,7
695,contact,7
696,stock,8
697,total,11
698,included,25
699,plan,28
700,wireless,16
701,video,49
702,original,48
703,wonderful,13
704,regular,28
705,leave,10
706,beautiful,6
707,system,35
708,school,14
709,crazy,8
710,functionality,15
711,ipad,17
712,fight,4
713,port,47
714,rip,3
715,browsing,19
716,multiple,26
717,wi,3
718,fi,1
719,lag,17
720,lock,26
721,movie,25
722,unit,55
723,returned,89
724,based,27
725,four,12
726,kindles,9
727,awhile,11
728,impressed,29
729,magazine,5
730,issue,51
731,leather,14
732,close,21
733,shuts,10
734,delivered,4
735,recharge,5
736,wall,13
737,accessory,2
738,fat,1
739,across,11
740,although,20
741,area,4
742,return,76
743,next,47
744,understanding,5
745,generic,2
746,forever,13
747,brand,15
748,timer,4
749,pandora,5
750,request,8
751,readily,4
752,block,5
753,giving,18
754,web,52
755,google,73
756,inside,8
757,task,3
758,college,11
759,win,2
760,thermostat,9
761,hear,22
762,receive,8
763,router,11
764,modem,4
765,processor,21
766,stated,6
767,surfing,17
768,waiting,13
769,held,6
770,green,1
771,niece,17
772,refund,12
773,turned,23
774,image,8
775,dark,17
776,im,3
777,delete,7
778,decision,6
779,ebooks,3
780,side,19
781,experience,36
782,doubt,5
783,question,35
784,calling,6
785,cut,12
786,speak,8
787,solution,8
788,personal,15
789,selection,15
790,neither,10
791,line,23
792,unhappy,6
793,match,5
794,security,6
795,nest,4
796,recognition,10
797,week,35
798,meant,7
799,automatically,6
800,current,10
801,car,9
802,unlock,9
803,grand,11
804,command,18
805,recognize,10
806,father,8
807,future,15
808,talk,12
809,heat,1
810,saver,5
811,country,5
812,knowing,5
813,rid,13
814,slip,2
815,password,10
816,left,21
817,mini,20
818,hassle,9
819,buffer,2
820,replacing,8
821,frustrating,15
822,played,15
823,offer,15
824,simply,22
825,sort,12
826,explained,6
827,effort,5
828,thanks,4
829,priced,17
830,short,21
831,usually,18
832,six,5
833,designed,11
834,within,31
835,lucky,1
836,realized,8
837,brightness,11
838,upgraded,11
839,hate,8
840,pop,15
841,earlier,8
842,software,27
843,sync,8
844,ready,20
845,complete,6
846,newer,22
847,finally,29
848,business,9
849,doesnt,14
850,immediately,11
851,actual,14
852,inch,10
853,cooking,5
854,calendar,5
855,making,37
856,adapter,8
857,forth,4
858,justify,5
859,bed,10
860,minute,7
861,eye,4
862,ordering,7
863,dollar,12
864,shop,7
865,advertising,14
866,looked,16
867,standard,12
868,cheap,71
869,general,12
870,write,4
871,alternative,14
872,table,29
873,volume,19
874,superior,5
875,location,4
876,customer,27
877,totally,21
878,sleep,6
879,bargain,11
880,boot,8
881,rating,10
882,email,29
883,hour,13
884,message,6
885,currently,11
886,alone,7
887,maybe,25
888,led,2
889,removed,7
890,afford,8
891,gone,7
892,stopped,28
893,hoping,31
894,edge,6
895,hope,22
896,harmony,4
897,controller,8
898,server,5
899,menu,13
900,christmas,6
901,froze,12
902,reset,20
903,stay,18
904,imagined,3
905,toddler,13
906,shut,14
907,trip,10
908,transfer,9
909,biggest,21
910,matter,23
911,non,10
912,warranty,30
913,skill,11
914,definition,5
915,show,32
916,sell,9
917,date,2
918,provided,9
919,course,13
920,picked,7
921,missing,10
922,sign,12
923,wire,3
924,broke,16
925,terrible,12
926,cracked,12
927,coming,14
928,changed,10
929,loading,14
930,viewing,13
931,constantly,26
932,begin,13
933,whatever,14
934,telling,11
935,crack,6
936,browser,23
937,oh,7
938,pair,6
939,unique,4
940,proof,4
941,switch,17
942,fault,9
943,protection,17
944,compatible,19
945,sold,7
946,prior,9
947,clue,4
948,happens,6
949,incredibly,7
950,mode,10
951,electronics,4
952,soon,16
953,sent,6
954,bestbuy,3
955,responding,6
956,remove,21
957,didnt,15
958,unless,37
959,installing,7
960,ai,2
961,search,43
962,tab,22
963,thus,8
964,clearly,6
965,connector,3
966,print,5
967,alot,13
968,requesting,5
969,putting,8
970,advertised,11
971,master,3
972,sat,5
973,offering,4
974,lower,12
975,key,5
976,research,17
977,locked,11
978,either,16
979,advertise,3
980,con,5
981,noticed,16
982,buck,3
983,taken,11
984,layout,5
985,drive,8
986,kind,26
987,complicated,12
988,mess,6
989,displaying,3
990,towards,11
991,saved,12
992,damage,7
993,continue,7
994,interest,4
995,common,10
996,phrase,6
997,pain,10
998,forget,11
999,exact,6
1000,packaging,4
1001,specifically,9
1002,defective,16
1003,fall,8
1004,hated,3
1005,despite,6
1006,pro,2
1007,person,33
1008,gaming,11
1009,running,11
1010,post,1
1011,answering,10
1012,sick,1
1013,automatic,4
1014,signal,7
1015,required,12
1016,overseas,1
1017,showtime,1
1018,playstation,2
1019,backup,3
1020,company,11
1021,site,12
1022,hopefully,4
1023,luckily,1
1024,okay,30
1025,lasted,10
1026,separate,6
1027,window,3
1028,stand,13
1029,flaw,6
1030,lack,27
1031,player,7
1032,floor,4
1033,spent,17
1034,visit,4
1035,quit,12
1036,plastic,8
1037,seeing,12
1038,lost,17
1039,thumb,2
1040,till,5
1041,average,16
1042,door,6
1043,desired,2
1044,sluggish,4
1045,closed,2
1046,sits,7
1047,register,12
1048,researched,9
1049,min,3
1050,annoying,22
1051,ground,3
1052,gmail,4
1053,syncing,5
1054,friday,10
1055,salesperson,3
1056,flash,9
1057,factory,12
1058,none,13
1059,siri,2
1060,portability,5
1061,isnt,4
1062,spotify,2
1063,late,4
1064,party,9
1065,vudu,2
1066,advertisement,7
1067,pad,9
1068,frustrated,13
1069,thank,4
1070,expecting,25
1071,provider,3
1072,activate,5
1073,etc,12
1074,cloud,5
1075,unplugged,7
1076,negative,7
1077,serious,8
1078,tough,9
1079,occasionally,7
1080,sad,7
1081,reached,3
1082,disappointment,4
1083,junk,2
1084,galaxy,4
1085,chrome,7
1086,drop,9
1087,cheapest,6
1088,happen,7
1089,slightly,10
1090,nook,5
1091,initial,9
1092,outlet,3
1093,weak,6
1094,dead,17
1095,noticeable,7
1096,fill,3
1097,loss,4
1098,quirky,2
1099,fail,7
1100,dumb,6
1101,newest,11
1102,became,8
1103,honestly,14
1104,special,18
1105,supported,4
1106,responded,2
1107,artist,5
1108,cumbersome,5
1109,stunning,2
1110,certainly,14
1111,hit,9
1112,planning,6
1113,limitation,3
1114,usage,8
1115,removing,3
1116,purpose,18
1117,wow,2
1118,care,21
1119,disappointing,7
1120,lacking,9
1121,unable,18
1122,attention,5
1123,holding,7
1124,ui,1
1125,surprise,9
1126,waste,25
1127,randomly,6
1128,upon,6
1129,therefore,4
1130,drain,2
1131,somewhat,12
1132,droid,1
1133,unlike,7
1134,checked,2
1135,yes,6
1136,tested,5
1137,navigating,5
1138,wo,1
1139,tube,6
1140,known,7
1141,hd,1
1142,expectation,2
1143,accidentally,3
1144,pen,2
1145,gb,5
1146,clock,4
1147,water,6
1148,engine,5
1149,sideload,4
1150,loose,8
1151,boy,3
1152,description,4
1153,graphic,1
1154,instruction,2
1155,switched,6
1156,holiday,4
1157,photo,1
1158,stuck,16
1159,owning,7
1160,ram,2
1161,receipt,3
1162,slide,1
1163,failed,8
1164,recognized,5
1165,worse,9
1166,clash,3
1167,wasnt,4
1168,samsung,6
1169,worst,9
1170,blank,2
1171,wont,7
1172,problematic,3
1173,realistic,2
1174,hdx,2
1175,unfortunately,7
1176,compatibility,4
1177,defect,4
1178,th,2
1179,shoot,1
1180,repair,1
1181,fed,2
1182,drove,2
1183,medium,1
1184,overcome,3
1185,behavior,2
1186,lesson,2
1187,apart,1
1188,squad,9
1189,fix,20
1190,rotate,5
1191,exchange,10
1192,upset,7
1193,associate,5
1194,shown,2
1195,discovered,8
1196,crashed,2
1197,felt,7
1198,logo,6
1199,starting,5
1200,restarting,4
1201,refurbished,7
1202,consumer,3
1203,stating,5
1204,headphone,4
1205,jack,1
1206,showing,7
1207,language,2
1208,restart,7
1209,slowest,2
1210,shocked,2
1211,poorly,7
1212,resolved,3
1213,auto,6
1214,corner,4
1215,positive,4
1216,hinge,9
1217,aware,10
1218,tight,3
1219,closure,2
1220,lie,4
1221,wikipedia,2
1222,together,5
1223,ink,4
1224,registered,5
1225,default,5
1226,refused,7
1227,spoke,4
1228,disconnected,6
1229,contacted,10
1230,extreme,3
1231,discount,2
1232,moment,4
1233,stable,2
1234,department,2
1235,impossible,6
1236,trick,1
1237,supply,3
1238,possible,6
1239,appliance,1
1240,sending,8
1241,include,11
1242,misleading,3
1243,securely,2
1244,reboot,7
1245,written,3
1246,ten,3
1247,gen,5
1248,wasted,4
1249,count,2
1250,notification,3
1251,repeated,3
1252,action,6
1253,ups,2
1254,file,2
1255,application,3
1256,ft,1
1257,flimsy,1
1258,useless,14
1259,ultraviolet,2
1260,elsewhere,2
1261,cpu,1
1262,hot,4
1263,warning,4
1264,luck,2
1265,rush,2
1266,defected,1
1267,goggle,2
1268,manually,4
1269,dust,1
1270,thrilled,4
1271,beside,2
1272,attempt,3
1273,equally,2
1274,dog,4
1275,shorted,2
1276,unfamiliar,2
1277,ad,7
1278,discontinued,2
1279,functioning,3
1280,stupid,3
1281,dosent,3
1282,resulting,3
1283,poor,15
1284,locate,5
1285,powering,3
1286,horrible,5
1287,position,2
1288,insert,2
1289,unreliable,1
1290,usb,5
1291,advance,2
1292,lose,4
1293,shooting,2
1294,mail,3
1295,troubleshooting,3
1296,situation,4
1297,accept,3
1298,unusable,2
1299,wear,4
1300,organization,2
1301,god,2
1302,pixel,7
1303,commonly,2
1304,epub,1
1305,frequently,7
1306,acceptable,3
1307,dime,2
1308,data,8
1309,bank,2
1310,gray,2
1311,clip,3
1312,lenovo,1
1313,icon,3
1314,unnecessary,3
1315,flag,3
1316,forced,2
1317,breaker,3
1318,inserted,1
1319,awful,1
1320,rca,1
1321,happened,5
1322,thanksgiving,4
1323,dec,2
1324,attempted,6
1325,cup,3
1326,chromecast,4
1327,plain,5
1328,hi,1
1329,attractive,5
1330,according,4
1331,note,4
1332,buyer,1
1333,glitch,5
1334,blocked,2
1335,pencil,1
1336,sharpener,1
1337,iphone,1
1338,mic,6
1339,policy,4
1340,integrate,5
1341,kiddos,2
1342,refuse,2
1343,annoyed,2
1344,deleted,4
1345,suggestion,2
1346,force,5
1347,accessibility,2
1348,laggy,1
1349,burn,2
1350,decently,1
1351,robot,1
1352,crash,2
1353,assured,3
1354,configuration,1
1355,fails,2
1356,follow,5
1357,buggy,1
1358,mentioned,3
1359,unknown,1
1360,log,2
1361,busted,1
1362,tomorrow,1
1363,official,1
1364,worthless,1
1365,claim,3
1366,bent,4
1367,silk,1
1368,repeatedly,3
1369,bend,3
1370,fox,1
1371,manufacturer,3
1372,repossess,2
1373,clearing,2
1374,cache,2
1375,reported,3
1376,unresponsive,2
1377,emailed,4
1378,suggesting,2
1379,everytime,1
1380,bubble,1
1381,recommendation,2
1382,selected,2
1383,foot,1
1384,verizon,1
1385,baught,2
1386,overpriced,2
1387,correct,3
1388,landscape,3
1389,nope,1
1390,portrate,1
1391,sec,3
1392,listing,1
1393,sorry,4
1394,employee,2
1395,tonight,1
1396,unacceptable,2
1397,paperweight,1
1398,shortly,2
1399,homepage,1
1400,certified,1
1401,loop,1
1402,unplug,4
1403,fiber,2
1404,optic,2
1405,ugly,2
1406,pointless,1
1407,empty,2
1408,heater,3
1409,disconnecting,2
1410,chargeable,1
1411,bass,3
1412,concept,6
1413,album,1
1414,tooth,4
1415,knowledgeable,2
1416,smarthome,3
1417,googling,2
1418,ring,2
1419,frame,8
1420,hype,2
1421,detail,1
1422,unsatisfied,1
1423,humidity,1
1424,socket,2
1425,state,2
1426,origami,2
1427,magnetic,1
1428,beware,2
1429,workmanship,1
1430,defeat,1
1431,exist,1
1432,clunky,2
1433,ether,1
1434,equipment,1
1435,roku,6
1436,expired,1
1437,plex,4
1438,fps,1
1439,hdmi,2
1440,perhaps,1
1441,decoding,2
1442,nexus,1
1443,remedy,1
1444,dx,1
1445,avoid,1
1446,rock,1
1447,warped,2
