{
	"info": {
		"_postman_id": "c8d4bbe5-12d2-4eb2-8dde-0e4087a78e6c",
		"name": "Django",
		"schema": "https://schema.getpostman.com/json/collection/v2.1.0/collection.json",
		"_exporter_id": "25584833"
	},
	"item": [
		{
			"name": "s01",
			"item": [
				{
					"name": "Todolist",
					"request": {
						"method": "GET",
						"header": [],
						"url": {
							"raw": "localhost:8000/todolist/",
							"host": [
								"localhost"
							],
							"port": "8000",
							"path": [
								"todolist",
								""
							]
						}
					},
					"response": []
				},
				{
					"name": "django_practice",
					"request": {
						"method": "GET",
						"header": [],
						"url": {
							"raw": "localhost:8000/django_practice/",
							"host": [
								"localhost"
							],
							"port": "8000",
							"path": [
								"django_practice",
								""
							]
						}
					},
					"response": []
				}
			]
		}
	]
}