{
	"info": {
		"_postman_id": "1905f24d-c118-478d-9759-1090609b3630",
		"name": "s36",
		"schema": "https://schema.getpostman.com/json/collection/v2.1.0/collection.json",
		"_exporter_id": "26192476"
	},
	"item": [
		{
			"name": "Get all tasks",
			"request": {
				"method": "GET",
				"header": [],
				"url": {
					"raw": "http://localhost:3001/tasks",
					"protocol": "http",
					"host": [
						"localhost"
					],
					"port": "3001",
					"path": [
						"tasks"
					]
				}
			},
			"response": []
		},
		{
			"name": "Add task",
			"request": {
				"method": "POST",
				"header": [],
				"body": {
					"mode": "raw",
					"raw": "{\r\n    \"name\": \"Eat Dinner\"\r\n}",
					"options": {
						"raw": {
							"language": "json"
						}
					}
				},
				"url": {
					"raw": "http://localhost:3001/tasks",
					"protocol": "http",
					"host": [
						"localhost"
					],
					"port": "3001",
					"path": [
						"tasks"
					]
				}
			},
			"response": []
		},
		{
			"name": "Delete task",
			"request": {
				"method": "DELETE",
				"header": [],
				"url": {
					"raw": "http://localhost:3001/tasks/642698ff5ded7938097a8f97",
					"protocol": "http",
					"host": [
						"localhost"
					],
					"port": "3001",
					"path": [
						"tasks",
						"642698ff5ded7938097a8f97"
					]
				}
			},
			"response": []
		},
		{
			"name": "Get task",
			"request": {
				"method": "GET",
				"header": [],
				"url": {
					"raw": "http://localhost:3001/tasks/642696d90c3c030cbb6",
					"protocol": "http",
					"host": [
						"localhost"
					],
					"port": "3001",
					"path": [
						"tasks",
						"642696d90c3c030cbb6"
					]
				}
			},
			"response": []
		},
		{
			"name": "Change status of task",
			"request": {
				"method": "PUT",
				"header": [],
				"url": {
					"raw": "http://localhost:3001/tasks/642699085ded7938097a8f9b",
					"protocol": "http",
					"host": [
						"localhost"
					],
					"port": "3001",
					"path": [
						"tasks",
						"642699085ded7938097a8f9b"
					]
				}
			},
			"response": []
		}
	]
}