{
	"info": {
		"_postman_id": "87085f01-d938-4b6e-aefd-18d01b3775d6",
		"name": "CAPSTONE",
		"schema": "https://schema.getpostman.com/json/collection/v2.1.0/collection.json",
		"_exporter_id": "26192520"
	},
	"item": [
		{
			"name": "User Registration",
			"request": {
				"method": "POST",
				"header": [],
				"body": {
					"mode": "raw",
					"raw": "{ \r\n\t\t\"email\": \"try@gmail.com\",\r\n        \"password\": \"admin123\"\r\n\r\n}",
					"options": {
						"raw": {
							"language": "json"
						}
					}
				},
				"url": {
					"raw": "http://localhost:4000/users/register",
					"protocol": "http",
					"host": [
						"localhost"
					],
					"port": "4000",
					"path": [
						"users",
						"register"
					]
				}
			},
			"response": []
		},
		{
			"name": "User Authentication",
			"request": {
				"method": "POST",
				"header": [],
				"body": {
					"mode": "raw",
					"raw": "{\r\n     \"email\": \"admin@gmail.com\",\r\n     \"password\": \"admin123\"\r\n}",
					"options": {
						"raw": {
							"language": "json"
						}
					}
				},
				"url": {
					"raw": "http://localhost:4000/users/login",
					"protocol": "http",
					"host": [
						"localhost"
					],
					"port": "4000",
					"path": [
						"users",
						"login"
					]
				}
			},
			"response": []
		},
		{
			"name": "Create Product (Admin only)",
			"request": {
				"auth": {
					"type": "bearer",
					"bearer": [
						{
							"key": "token",
							"value": "eyJhbGciOiJIUzI1NiIsInR5cCI6IkpXVCJ9.eyJpZCI6IjY0M2E2NzFhOTI2NzY4ZDBiZjRmM2I1NiIsImVtYWlsIjoiYWRtaW5AZ21haWwuY29tIiwiaXNBZG1pbiI6dHJ1ZSwiaWF0IjoxNjgxNTQ5MTYyfQ.ZDRrBl7WV0SIAJCyAZXpS-_iuZwxNSPgtBiS7qRrf10",
							"type": "string"
						}
					]
				},
				"method": "POST",
				"header": [],
				"body": {
					"mode": "raw",
					"raw": "{       \"name\": \"Asus \",\r\n\t\t\"description\": \"28inch 144Hz\",\r\n\t\t\"price\": 9000,\r\n        \"quantity\": 10\r\n      \r\n}",
					"options": {
						"raw": {
							"language": "json"
						}
					}
				},
				"url": {
					"raw": "http://localhost:4000/products/create",
					"protocol": "http",
					"host": [
						"localhost"
					],
					"port": "4000",
					"path": [
						"products",
						"create"
					]
				}
			},
			"response": []
		},
		{
			"name": "Retrieve all active products",
			"request": {
				"method": "GET",
				"header": [],
				"url": {
					"raw": "http://localhost:4000/product/active",
					"protocol": "http",
					"host": [
						"localhost"
					],
					"port": "4000",
					"path": [
						"product",
						"active"
					]
				}
			},
			"response": []
		},
		{
			"name": "Retrieve single products",
			"request": {
				"method": "GET",
				"header": [],
				"url": {
					"raw": "http://localhost:4000/product/6436b9b4be6eea03190c66ac",
					"protocol": "http",
					"host": [
						"localhost"
					],
					"port": "4000",
					"path": [
						"product",
						"6436b9b4be6eea03190c66ac"
					]
				}
			},
			"response": []
		},
		{
			"name": "Update Product information(Admin only)",
			"request": {
				"method": "PUT",
				"header": [],
				"body": {
					"mode": "raw",
					"raw": "{\r\n    \"name\": \"Asus TUF Gaming monitor\",\r\n    \"description\": \"23.8inch 165Hz\",\r\n    \"price\": 9000\r\n}",
					"options": {
						"raw": {
							"language": "json"
						}
					}
				},
				"url": {
					"raw": "http://localhost:4000/courses/642ba2f7190e89c64cb98434",
					"protocol": "http",
					"host": [
						"localhost"
					],
					"port": "4000",
					"path": [
						"courses",
						"642ba2f7190e89c64cb98434"
					]
				}
			},
			"response": []
		},
		{
			"name": "Archieve A Product(Admin only)",
			"request": {
				"auth": {
					"type": "bearer",
					"bearer": [
						{
							"key": "token",
							"value": "eyJhbGciOiJIUzI1NiIsInR5cCI6IkpXVCJ9.eyJpZCI6IjY0MmJhMjY2N2RlZmVmYTdhMDVmYzEyYSIsImVtYWlsIjoiY2FuaWVsbWFuemFub0BnbWFpbC5jb20iLCJpc0FkbWluIjp0cnVlLCJpYXQiOjE2ODA1OTUyODB9.MGCOqeAEY96XeGhVCneVENytCfIOSc0IF3nrTscIwSo",
							"type": "string"
						}
					]
				},
				"method": "PATCH",
				"header": [],
				"body": {
					"mode": "raw",
					"raw": "{\r\n    \"isActive\": \"false\"\r\n}",
					"options": {
						"raw": {
							"language": "json"
						}
					}
				},
				"url": {
					"raw": "http://localhost:4000/courses/642ba2f7190e89c64cb98434/archive",
					"protocol": "http",
					"host": [
						"localhost"
					],
					"port": "4000",
					"path": [
						"courses",
						"642ba2f7190e89c64cb98434",
						"archive"
					]
				}
			},
			"response": []
		},
		{
			"name": "Non-admin user checkout (Create order)",
			"request": {
				"auth": {
					"type": "bearer",
					"bearer": [
						{
							"key": "token",
							"value": "eyJhbGciOiJIUzI1NiIsInR5cCI6IkpXVCJ9.eyJpZCI6IjY0M2E0NjZhODBhMzMwMjM3ZDZjMmE2NCIsImVtYWlsIjoiYWRtaW5AZ21haWwuY29tIiwiaXNBZG1pbiI6ZmFsc2UsImlhdCI6MTY4MTU0MTEwMn0.6IAP8wjs-GR6tXPbDCKZQIY3B4jOgwfkkzwg24s6XAE",
							"type": "string"
						}
					]
				},
				"method": "POST",
				"header": [],
				"body": {
					"mode": "raw",
					"raw": "{\r\n    \"productId\": \"643a51bbbcaa02aaa4564e5a\",\r\n    \"quantity\": \"12\"\r\n    \r\n}",
					"options": {
						"raw": {
							"language": "json"
						}
					}
				},
				"url": {
					"raw": "http://localhost:4000/users/order",
					"protocol": "http",
					"host": [
						"localhost"
					],
					"port": "4000",
					"path": [
						"users",
						"order"
					]
				}
			},
			"response": []
		},
		{
			"name": "retrieve user details",
			"request": {
				"method": "POST",
				"header": [],
				"body": {
					"mode": "raw",
					"raw": "{\r\n    \"id\": \"642a86a44da652e922b0191d\"\r\n\r\n}",
					"options": {
						"raw": {
							"language": "json"
						}
					}
				},
				"url": {
					"raw": "http://localhost:4000/users/details",
					"protocol": "http",
					"host": [
						"localhost"
					],
					"port": "4000",
					"path": [
						"users",
						"details"
					]
				}
			},
			"response": []
		},
		{
			"name": "retrieve all products",
			"request": {
				"method": "GET",
				"header": [],
				"url": {
					"raw": "http://localhost:4000/courses/all",
					"protocol": "http",
					"host": [
						"localhost"
					],
					"port": "4000",
					"path": [
						"courses",
						"all"
					]
				}
			},
			"response": []
		},
		{
			"name": "check if email exists",
			"request": {
				"method": "GET",
				"header": []
			},
			"response": []
		},
		{
			"name": "Change user to admin",
			"request": {
				"method": "PUT",
				"header": [],
				"url": {
					"raw": "http://localhost:4000/users/6436cf652e29e921835fb955",
					"protocol": "http",
					"host": [
						"localhost"
					],
					"port": "4000",
					"path": [
						"users",
						"6436cf652e29e921835fb955"
					]
				}
			},
			"response": []
		}
	]
}