{
	"info": {
		"_postman_id": "8df5b2f8-2e07-4f59-86ad-afbbfc26a2dd",
		"name": "B256_EcommerceAPI",
		"schema": "https://schema.getpostman.com/json/collection/v2.1.0/collection.json",
		"_exporter_id": "25781710"
	},
	"item": [
		{
			"name": "Register User using POST",
			"request": {
				"method": "POST",
				"header": [],
				"body": {
					"mode": "raw",
					"raw": "{\r\n    \"email\": \"admin@gmail.com\",\r\n    \"password\": \"admin1234\",\r\n    \"isAdmin\": false\r\n}",
					"options": {
						"raw": {
							"language": "json"
						}
					}
				},
				"url": {
					"raw": "localhost:3001/users/register",
					"host": [
						"localhost"
					],
					"port": "3001",
					"path": [
						"users",
						"register"
					]
				}
			},
			"response": []
		},
		{
			"name": "Authenticate User",
			"request": {
				"method": "POST",
				"header": [],
				"body": {
					"mode": "raw",
					"raw": "{\r\n    \"email\": \"dianebiscocho@gmail.com\",\r\n    \"password\": \"diane1234\"\r\n}",
					"options": {
						"raw": {
							"language": "json"
						}
					}
				},
				"url": {
					"raw": "localhost:3001/users/login",
					"host": [
						"localhost"
					],
					"port": "3001",
					"path": [
						"users",
						"login"
					]
				}
			},
			"response": []
		},
		{
			"name": "Create New Product (Admin Only)",
			"request": {
				"auth": {
					"type": "bearer",
					"bearer": [
						{
							"key": "token",
							"value": "eyJhbGciOiJIUzI1NiIsInR5cCI6IkpXVCJ9.eyJpZCI6IjY0M2QxOGE4YWZiZjJhMzNhOGUwY2Q5YSIsImVtYWlsIjoiYWRtaW5AbWFpbC5jb20iLCJpc0FkbWluIjp0cnVlLCJpYXQiOjE2ODE3MjU3MzV9.ckjOjrqA31mn-IJ9JTDKJtrbaGic9HnCoWz9AXn-XeI",
							"type": "string"
						}
					]
				},
				"method": "POST",
				"header": [],
				"body": {
					"mode": "raw",
					"raw": "{\r\n\"name\": \"Guided Investor, Fearless Trader\",\r\n\"description\": \"Our flagship 3-part learning series that is specially curated for advanced traders who have already been trading the market and want to improve portfolio performance. GIFT is conducted by our Market Consultant, Aaron Say, who will guide you hands-on throughout the whole series.\",\r\n\"price\" : 5000\r\n\r\n\r\n}",
					"options": {
						"raw": {
							"language": "json"
						}
					}
				},
				"url": {
					"raw": "localhost:3001/products/create",
					"host": [
						"localhost"
					],
					"port": "3001",
					"path": [
						"products",
						"create"
					]
				}
			},
			"response": []
		},
		{
			"name": "Retrieve All Active Products",
			"request": {
				"method": "GET",
				"header": []
			},
			"response": []
		}
	]
}