{
	"info": {
		"_postman_id": "5e559c35-a03c-433f-97a6-79b9c140f993",
		"name": "s34_Activity",
		"schema": "https://schema.getpostman.com/json/collection/v2.1.0/collection.json",
		"_exporter_id": "25184714"
	},
	"item": [
		{
			"name": "GET /home",
			"request": {
				"method": "GET",
				"header": []
			},
			"response": []
		},
		{
			"name": "GET /items",
			"request": {
				"method": "GET",
				"header": []
			},
			"response": []
		},
		{
			"name": "DELETE /delete-item",
			"request": {
				"method": "DELETE",
				"header": [],
				"url": {
					"raw": "localhost:3000/delete-item",
					"host": [
						"localhost"
					],
					"port": "3000",
					"path": [
						"delete-item"
					]
				}
			},
			"response": []
		}
	]
}