{
	"_id": "300ZMAD88XC",
	"name": "Fairtex BG1",
	"description": "Boxing gloves for sparring and heavy bag",
	"price": 5000,
	"stocks": 2,
	"isActive": true,
	"SKU": "EWEMS2JD82MD9ZC"
}

{
	"_id": "300PP0289D",
	"name": "Twins Boxing Gloves",
	"description": "Boxing gloves for Sparring",
	"price": 4500,
	"stocks": 3,
	"isActive": true,
	"SKU": "SDSDFMS2JD82MD9"
}

{
	"_id": "300QLWPD88J",
	"name": "Hayabusa Handwraps",
	"description": "handwraps for wrist and knuckle protection muay thai boxing",
	"price": 500,
	"stocks": 8,
	"isActive": true,
	"SKU": "DD23FUWERWEM9R"
}

{
	"_id": "300TYWEI28",
	"name": "Excalibur Headgear",
	"description": "Headgear for combat competition and sparring",
	"price": 1200,
	"stocks": 4,
	"isActive": true,
	"SKU": "1S94AMISD9SDDS"
}
