{
	"info": {
		"_postman_id": "1cf66534-cefe-4f44-ab6b-dfa7b43dc679",
		"name": "s34-Activity",
		"schema": "https://schema.getpostman.com/json/collection/v2.1.0/collection.json",
		"_exporter_id": "25189289"
	},
	"item": [
		{
			"name": "home route",
			"request": {
				"method": "GET",
				"header": [],
				"url": {
					"raw": "http://localhost:4004/home",
					"protocol": "http",
					"host": [
						"localhost"
					],
					"port": "4004",
					"path": [
						"home"
					]
				}
			},
			"response": []
		},
		{
			"name": "users route",
			"request": {
				"method": "GET",
				"header": []
			},
			"response": []
		},
		{
			"name": "delete route",
			"request": {
				"method": "DELETE",
				"header": [],
				"body": {
					"mode": "raw",
					"raw": "{\r\n    \"username\" : \"Mavis\"\r\n}",
					"options": {
						"raw": {
							"language": "json"
						}
					}
				},
				"url": {
					"raw": "http://localhost:4004/delete-user",
					"protocol": "http",
					"host": [
						"localhost"
					],
					"port": "4004",
					"path": [
						"delete-user"
					]
				}
			},
			"response": []
		}
	]
}