{
	"_id" : "G001I1",
	"name" : "Smart Phone",
	"description" : {
		"brand" : "Huawei",
		"model" : "Nova 9"
	},
	"price" : 18000,
	"stocks" : 5,
	"isActive" : true,
	"SKU" : "HWNV9SN12"	
}

{
	"_id" : "G002I1",
	"name" : "Laptop",
	"description" : {
		"brand" : "Acer",
		"model" : "Aspire 5"
	},
	"price" : 31549,
	"stocks" : 0,
	"isActive" : false,
	"SKU" : "ACA501STN35"	
}

{
	"_id" : "AC001P3I1",
	"name" : "Bag",
	"description" : {
		"brand" : "Vans",
		"type" : "sling"
	},
	"price" : 500,
	"stocks" : 5,
	"isActive" : true,
	"SKU" : "BVSA0168T"	
}