{
	"id": "prod100001",
	"name": "T-Shirt",
	"description": "Freesize Women's Shirt",
	"Price": 280,
	"Stocks": 20,
	"isActive": true,
	"SKU": "abc1000001"
}

{
	"id": "prod100002",
	"name": "Pants",
	"description": "Freesize Women's Pants",
	"Price": 780,
	"Stocks": 20,
	"isActive": true,
	"SKU": "abc1000002"
}

{
	"id": "prod100003",
	"name": "Shorts",
	"description": "Freesize Women's Shorts",
	"Price": 180,
	"Stocks": 20,
	"isActive": true,
	"SKU": "abc1000003"
}