[
    {
        "_id": "200qwerty",
        "userID": "100qwerty",
        "datetimeTransactionCreated": "2023-02-14T21:00:00.00Z",
        "status": true,
        "total": 120
    },
    {
        "_id": "200asdfg",
        "userID": "100asdfg",
        "datetimeTransactionCreated": "2023-02-14T21:01:00.00Z",
        "status": true,
        "total": 240
    },
    {
        "_id": "200zxcvb",
        "userID": "100zxcvb",
        "datetimeTransactionCreated": "2023-02-14T21:02:00.00Z",
        "status": true,
        "total": 15
    }
]
