{
	"_id":"op_0001",
	"oderID":"",
	"productID":"or_0001",
	"quantity":2,
	"price":1000,
	"subTotal":1000
},
{
	"_id":"op_0002",
	"oderID":"",
	"productID":"or_0002",
	"quantity":2,
	"price":1000,
	"subTotal":2000
},
{
	"_id":"op_0003",
	"oderID":"",
	"productID":"or_0003",
	"quantity":3,
	"price":1000,
	"subTotal":3000
}