{
	"info": {
		"_postman_id": "c620e2fc-88c4-4cbd-be64-c47945ae2401",
		"name": "Course Booking API",
		"schema": "https://schema.getpostman.com/json/collection/v2.1.0/collection.json",
		"_exporter_id": "25584848"
	},
	"item": [
		{
			"name": "Users",
			"item": [
				{
					"name": "POST \"userRegistration\"",
					"request": {
						"method": "POST",
						"header": [],
						"body": {
							"mode": "raw",
							"raw": "{\r\n    \"firstName\": \"admin\",\r\n    \"lastName\": \"admin\",\r\n    \"email\": \"trial2@mail.com\",\r\n    \"password\": \"1234\",\r\n    \"mobileNo\": \"0987654321\"\r\n}",
							"options": {
								"raw": {
									"language": "json"
								}
							}
						},
						"url": {
							"raw": "localhost:3001/user/register",
							"host": [
								"localhost"
							],
							"port": "3001",
							"path": [
								"user",
								"register"
							]
						}
					},
					"response": []
				},
				{
					"name": "POST \"userAuthentication\"",
					"request": {
						"method": "POST",
						"header": [],
						"body": {
							"mode": "raw",
							"raw": "{\r\n    \"email\": \"admin@mail.com\",\r\n    \"password\": \"admin\"\r\n}",
							"options": {
								"raw": {
									"language": "json"
								}
							}
						},
						"url": {
							"raw": "localhost:3001/user/login",
							"host": [
								"localhost"
							],
							"port": "3001",
							"path": [
								"user",
								"login"
							]
						}
					},
					"response": []
				},
				{
					"name": "GET \"userDetails\"",
					"request": {
						"auth": {
							"type": "bearer",
							"bearer": [
								{
									"key": "token",
									"value": "{{admin}}",
									"type": "string"
								}
							]
						},
						"method": "GET",
						"header": [],
						"url": {
							"raw": "localhost:3001/user/details",
							"host": [
								"localhost"
							],
							"port": "3001",
							"path": [
								"user",
								"details"
							]
						}
					},
					"response": []
				},
				{
					"name": "POST \"enrollCourse\"",
					"request": {
						"auth": {
							"type": "bearer",
							"bearer": [
								{
									"key": "token",
									"value": "{{admin}}",
									"type": "string"
								}
							]
						},
						"method": "POST",
						"header": [],
						"url": {
							"raw": "localhost:3001/user/enroll/63e0b4340d157f8d5a4d4512",
							"host": [
								"localhost"
							],
							"port": "3001",
							"path": [
								"user",
								"enroll",
								"63e0b4340d157f8d5a4d4512"
							]
						}
					},
					"response": []
				}
			]
		},
		{
			"name": "Courses",
			"item": [
				{
					"name": "GET \"Add course\"",
					"request": {
						"auth": {
							"type": "bearer",
							"bearer": [
								{
									"key": "token",
									"value": "eyJhbGciOiJIUzI1NiIsInR5cCI6IkpXVCJ9.eyJfaWQiOiI2M2RjYmU5MGUxM2FiMzM0ODEwMWRmYTkiLCJlbWFpbCI6ImFkbWluQG1haWwuY29tIiwiaXNBZG1pbiI6dHJ1ZSwiaWF0IjoxNjc1NDExMjY3fQ.isoVtwT1A0BsG0fYaPIHCHqhN-GWDHpn-CQ9Isy9iVc",
									"type": "string"
								}
							]
						},
						"method": "POST",
						"header": [],
						"body": {
							"mode": "raw",
							"raw": "{\r\n    \"name\": \"special course2\",\r\n    \"description\": \"special2\",\r\n    \"price\": 5000\r\n}",
							"options": {
								"raw": {
									"language": "json"
								}
							}
						},
						"url": {
							"raw": "localhost:3001/course/",
							"host": [
								"localhost"
							],
							"port": "3001",
							"path": [
								"course",
								""
							]
						}
					},
					"response": []
				},
				{
					"name": "GET \"allCourses\"",
					"request": {
						"auth": {
							"type": "bearer",
							"bearer": [
								{
									"key": "token",
									"value": "{{admin}}",
									"type": "string"
								}
							]
						},
						"method": "GET",
						"header": [],
						"url": {
							"raw": "localhost:3001/course/all",
							"host": [
								"localhost"
							],
							"port": "3001",
							"path": [
								"course",
								"all"
							]
						}
					},
					"response": []
				},
				{
					"name": "GET \"allActiveCourses\"",
					"request": {
						"method": "GET",
						"header": [],
						"url": {
							"raw": "localhost:3001/course/allActive",
							"host": [
								"localhost"
							],
							"port": "3001",
							"path": [
								"course",
								"allActive"
							]
						}
					},
					"response": []
				},
				{
					"name": "GET \"allInactiveCourses\"",
					"request": {
						"auth": {
							"type": "bearer",
							"bearer": [
								{
									"key": "token",
									"value": "{{admin}}",
									"type": "string"
								}
							]
						},
						"method": "GET",
						"header": [],
						"url": {
							"raw": "localhost:3001/course/allInactive",
							"host": [
								"localhost"
							],
							"port": "3001",
							"path": [
								"course",
								"allInactive"
							]
						}
					},
					"response": []
				},
				{
					"name": "GET \"courseDetails\"",
					"request": {
						"method": "GET",
						"header": [],
						"url": {
							"raw": "localhost:3001/course/63dcb3c0fa00bad539407890",
							"host": [
								"localhost"
							],
							"port": "3001",
							"path": [
								"course",
								"63dcb3c0fa00bad539407890"
							]
						}
					},
					"response": []
				},
				{
					"name": "PUT \"updateCourse\"",
					"request": {
						"auth": {
							"type": "bearer",
							"bearer": [
								{
									"key": "token",
									"value": "{{admin}}",
									"type": "string"
								}
							]
						},
						"method": "PUT",
						"header": [],
						"body": {
							"mode": "raw",
							"raw": "{\r\n    \"name\": \"updatedName2\",\r\n    \"description\": \"updatedDescription\",\r\n    \"price\": 0\r\n}",
							"options": {
								"raw": {
									"language": "json"
								}
							}
						},
						"url": {
							"raw": "localhost:3001/course/update/63dccc721909a40c46d1f1c3",
							"host": [
								"localhost"
							],
							"port": "3001",
							"path": [
								"course",
								"update",
								"63dccc721909a40c46d1f1c3"
							]
						}
					},
					"response": []
				},
				{
					"name": "PATCH \"archiveCourse\"",
					"request": {
						"auth": {
							"type": "bearer",
							"bearer": [
								{
									"key": "token",
									"value": "{{admin}}",
									"type": "string"
								}
							]
						},
						"method": "PATCH",
						"header": [],
						"body": {
							"mode": "raw",
							"raw": "{\r\n    \"isActive\": false\r\n}",
							"options": {
								"raw": {
									"language": "json"
								}
							}
						},
						"url": {
							"raw": "localhost:3001/course/archive/63dccc721909a40c46d1f1c3",
							"host": [
								"localhost"
							],
							"port": "3001",
							"path": [
								"course",
								"archive",
								"63dccc721909a40c46d1f1c3"
							]
						}
					},
					"response": []
				}
			]
		}
	],
	"variable": [
		{
			"key": "admin",
			"value": "eyJhbGciOiJIUzI1NiIsInR5cCI6IkpXVCJ9.eyJfaWQiOiI2M2RjYmU5MGUxM2FiMzM0ODEwMWRmYTkiLCJlbWFpbCI6ImFkbWluQG1haWwuY29tIiwiaXNBZG1pbiI6dHJ1ZSwiaWF0IjoxNjc1NjQzODQyfQ.MNrIlnQ14BPwQcPk6pDUp69FxW9MPjwxZevFREUrxX8"
		}
	]
}