{
	"info": {
		"_postman_id": "834e317e-68a5-44b1-b3cf-6f5c8fff8d27",
		"name": "Capstone 2",
		"schema": "https://schema.getpostman.com/json/collection/v2.1.0/collection.json",
		"_exporter_id": "25584849"
	},
	"item": [
		{
			"name": "User",
			"item": [
				{
					"name": "User Registration",
					"request": {
						"method": "POST",
						"header": [],
						"body": {
							"mode": "raw",
							"raw": "{\r\n    \"email\": \"ramenhokage@konoha.com\",\r\n    \"password\": \"dattebayo\"\r\n}",
							"options": {
								"raw": {
									"language": "json"
								}
							}
						},
						"url": {
							"raw": "localhost:4000/user/register",
							"host": [
								"localhost"
							],
							"port": "4000",
							"path": [
								"user",
								"register"
							]
						}
					},
					"response": []
				},
				{
					"name": "User Authentication",
					"request": {
						"auth": {
							"type": "bearer",
							"bearer": [
								{
									"key": "token",
									"value": "{{newNaruto}}",
									"type": "string"
								}
							]
						},
						"method": "POST",
						"header": [],
						"body": {
							"mode": "raw",
							"raw": "{\r\n    \"email\": \"ramenhokage@konoha.com\",\r\n    \"password\": \"dattebayo\"\r\n}",
							"options": {
								"raw": {
									"language": "json"
								}
							}
						},
						"url": {
							"raw": "localhost:4000/user/login",
							"host": [
								"localhost"
							],
							"port": "4000",
							"path": [
								"user",
								"login"
							]
						}
					},
					"response": []
				},
				{
					"name": "View own profile",
					"request": {
						"auth": {
							"type": "bearer",
							"bearer": [
								{
									"key": "token",
									"value": "{{newNaruto}}",
									"type": "string"
								}
							]
						},
						"method": "GET",
						"header": [],
						"url": {
							"raw": "localhost:4000/user/myProfile",
							"host": [
								"localhost"
							],
							"port": "4000",
							"path": [
								"user",
								"myProfile"
							]
						}
					},
					"response": []
				},
				{
					"name": "Grant/Remove admin status",
					"request": {
						"auth": {
							"type": "bearer",
							"bearer": [
								{
									"key": "token",
									"value": "{{giorno}}",
									"type": "string"
								}
							]
						},
						"method": "POST",
						"header": [],
						"body": {
							"mode": "raw",
							"raw": "{\r\n    \"isAdmin\": true\r\n}",
							"options": {
								"raw": {
									"language": "json"
								}
							}
						},
						"url": {
							"raw": "localhost:4000/user/giveAdmin/63e076c4d26608d497a035ca",
							"host": [
								"localhost"
							],
							"port": "4000",
							"path": [
								"user",
								"giveAdmin",
								"63e076c4d26608d497a035ca"
							]
						}
					},
					"response": []
				}
			]
		},
		{
			"name": "Product",
			"item": [
				{
					"name": "Create Product",
					"request": {
						"auth": {
							"type": "bearer",
							"bearer": [
								{
									"key": "token",
									"value": "{{ginAdmin}}",
									"type": "string"
								}
							]
						},
						"method": "POST",
						"header": [],
						"body": {
							"mode": "raw",
							"raw": "{\r\n    \"name\": \"No Sauce\",\r\n    \"description\": \"Prefer your noodles pure and clean? Choose this option!\",\r\n    \"price\": 0,\r\n    \"class\": \"sauce\"\r\n}",
							"options": {
								"raw": {
									"language": "json"
								}
							}
						},
						"url": {
							"raw": "localhost:4000/product/create",
							"host": [
								"localhost"
							],
							"port": "4000",
							"path": [
								"product",
								"create"
							]
						}
					},
					"response": []
				},
				{
					"name": "View full menu",
					"request": {
						"method": "GET",
						"header": [],
						"url": {
							"raw": "localhost:4000/product/menu",
							"host": [
								"localhost"
							],
							"port": "4000",
							"path": [
								"product",
								"menu"
							]
						}
					},
					"response": []
				},
				{
					"name": "View menu by categories (wok, toppings, sauce)",
					"request": {
						"method": "GET",
						"header": [],
						"url": {
							"raw": "localhost:4000/product/menu/toppings",
							"host": [
								"localhost"
							],
							"port": "4000",
							"path": [
								"product",
								"menu",
								"toppings"
							]
						}
					},
					"response": []
				},
				{
					"name": "View specified menu item",
					"request": {
						"method": "GET",
						"header": [],
						"url": {
							"raw": "localhost:4000/product/63e1a18dff5e2f4aec490d51",
							"host": [
								"localhost"
							],
							"port": "4000",
							"path": [
								"product",
								"63e1a18dff5e2f4aec490d51"
							]
						}
					},
					"response": []
				},
				{
					"name": "Updating a product",
					"request": {
						"auth": {
							"type": "bearer",
							"bearer": [
								{
									"key": "token",
									"value": "{{ginAdmin}}",
									"type": "string"
								}
							]
						},
						"method": "PUT",
						"header": [],
						"body": {
							"mode": "raw",
							"raw": "{\r\n    \"name\": \"Wok (Large)\",\r\n    \"description\": \"Handmade noodles cooked in your favorite sauce and topped with ingredients of your choice! Now available in large size!\",\r\n    \"price\": 160,\r\n    \"class\": \"wok\"\r\n}",
							"options": {
								"raw": {
									"language": "json"
								}
							}
						},
						"url": {
							"raw": "localhost:4000/product/edit/63e1a18dff5e2f4aec490d51",
							"host": [
								"localhost"
							],
							"port": "4000",
							"path": [
								"product",
								"edit",
								"63e1a18dff5e2f4aec490d51"
							]
						}
					},
					"response": []
				},
				{
					"name": "Archive a product (Update status availability)",
					"request": {
						"auth": {
							"type": "bearer",
							"bearer": [
								{
									"key": "token",
									"value": "{{ginAdmin}}",
									"type": "string"
								}
							]
						},
						"method": "PUT",
						"header": [],
						"body": {
							"mode": "raw",
							"raw": "{\r\n    \"isAvailable\": false\r\n}",
							"options": {
								"raw": {
									"language": "json"
								}
							}
						},
						"url": {
							"raw": "localhost:4000/product/archive/63e0c118fa3cce5f80852225",
							"host": [
								"localhost"
							],
							"port": "4000",
							"path": [
								"product",
								"archive",
								"63e0c118fa3cce5f80852225"
							]
						}
					},
					"response": []
				}
			]
		},
		{
			"name": "Orders",
			"item": [
				{
					"name": "Checking Out (creating order)",
					"request": {
						"auth": {
							"type": "bearer",
							"bearer": [
								{
									"key": "token",
									"value": "{{newNaruto}}",
									"type": "string"
								}
							]
						},
						"method": "POST",
						"header": [],
						"body": {
							"mode": "raw",
							"raw": "{\r\n    \"noodle\": \"63e0bfa2609d5bdec8fc3a47\",\r\n    \"topping1\": \"63e217d6cd3b91d530bdd854\",\r\n    \"topping2\": \"63e1aa7961ef653dcd9a37b3\",\r\n    \"topping3\": \"63e1dd57208d0edae3e6f022\",\r\n    \"sauce\": \"63e1ad804741675a9bb28373\",\r\n    \"address\": \"Hokage's Office, Hokage Rock, Konoha, Land of Fire\",\r\n    \"quantity\": 1\r\n}",
							"options": {
								"raw": {
									"language": "json"
								}
							}
						},
						"url": {
							"raw": "localhost:4000/order/checkout",
							"host": [
								"localhost"
							],
							"port": "4000",
							"path": [
								"order",
								"checkout"
							]
						}
					},
					"response": []
				},
				{
					"name": "Starting a cart",
					"request": {
						"auth": {
							"type": "bearer",
							"bearer": [
								{
									"key": "token",
									"value": "{{newNaruto}}",
									"type": "string"
								}
							]
						},
						"method": "POST",
						"header": [],
						"body": {
							"mode": "raw",
							"raw": "{\r\n    \"quantity\": 2\r\n}",
							"options": {
								"raw": {
									"language": "json"
								}
							}
						},
						"url": {
							"raw": "localhost:4000/order/startCart/63e0bfa2609d5bdec8fc3a47",
							"host": [
								"localhost"
							],
							"port": "4000",
							"path": [
								"order",
								"startCart",
								"63e0bfa2609d5bdec8fc3a47"
							]
						}
					},
					"response": []
				}
			]
		}
	],
	"variable": [
		{
			"key": "giorno",
			"value": "eyJhbGciOiJIUzI1NiIsInR5cCI6IkpXVCJ9.eyJfaWQiOiI2M2UwNzZjNGQyNjYwOGQ0OTdhMDM1Y2EiLCJlbWFpbCI6Imdpb3Jub2dpb3Zhbm5hQGRyZWFtLmNvbSIsImlzQWRtaW4iOmZhbHNlLCJpYXQiOjE2NzU2NzA5NzV9.-FNRpGHjcbniBTdg92hzVFKMYZ0RUfWeQdWEYXN1yVQ"
		},
		{
			"key": "ginAdmin",
			"value": "eyJhbGciOiJIUzI1NiIsInR5cCI6IkpXVCJ9.eyJfaWQiOiI2M2UwNzY4ZmQyNjYwOGQ0OTdhMDM1YzciLCJlbWFpbCI6ImdpbnRva2lAZ21haWwuY29tIiwiaXNBZG1pbiI6dHJ1ZSwiaWF0IjoxNjc1NjcxMDI5fQ.PxDRchyHMns2VPz7qM4a04A5y8DNb5jEl1ek2f9h7mI"
		},
		{
			"key": "tifa",
			"value": "eyJhbGciOiJIUzI1NiIsInR5cCI6IkpXVCJ9.eyJfaWQiOiI2M2UwNzZmMGQyNjYwOGQ0OTdhMDM1Y2UiLCJlbWFpbCI6InRsb2NraGVhcnRAN2hlYXZlbi5jb20iLCJpc0FkbWluIjpmYWxzZSwiaWF0IjoxNjc1NzM3NzE0fQ.sH3gF3Q-o2gesc7D7wbQAC7vRpyu8Q0GIBuL3uU9gXc"
		},
		{
			"key": "naruto",
			"value": "eyJhbGciOiJIUzI1NiIsInR5cCI6IkpXVCJ9.eyJfaWQiOiI2M2UxYmQwMTNlMmFiN2U1ODVjYjFlNzAiLCJlbWFpbCI6InJhbWVuaG9rYWdlQGtvbm9oYS5jb20iLCJpc0FkbWluIjpmYWxzZSwiaWF0IjoxNjc1NzM4Mzg3fQ.3iZ9KoxC2vbh7l5WsGBMkRT9id9V2PkFa34hjWj30NI"
		},
		{
			"key": "newNaruto",
			"value": "eyJhbGciOiJIUzI1NiIsInR5cCI6IkpXVCJ9.eyJfaWQiOiI2M2UyMGEzODhhMDVjNjhhNTA2ZTA4MmQiLCJlbWFpbCI6InJhbWVuaG9rYWdlQGtvbm9oYS5jb20iLCJpc0FkbWluIjpmYWxzZSwiaWF0IjoxNjc1NzU4MTcwfQ.p0xu5vOOH6cwD4fcC1_pbh5peEi60iAjthbviLG74IQ"
		}
	]
}