{
	"info": {
		"_postman_id": "834e317e-68a5-44b1-b3cf-6f5c8fff8d27",
		"name": "Capstone 2",
		"schema": "https://schema.getpostman.com/json/collection/v2.1.0/collection.json",
		"_exporter_id": "25584849"
	},
	"item": [
		{
			"name": "User",
			"item": [
				{
					"name": "User Registration",
					"request": {
						"method": "POST",
						"header": [],
						"body": {
							"mode": "raw",
							"raw": "{\r\n    \"email\": \"ramenhokage@konoha.com\",\r\n    \"password\": \"dattebayo\"\r\n}",
							"options": {
								"raw": {
									"language": "json"
								}
							}
						},
						"url": {
							"raw": "localhost:4000/user/register",
							"host": [
								"localhost"
							],
							"port": "4000",
							"path": [
								"user",
								"register"
							]
						}
					},
					"response": []
				},
				{
					"name": "User Authentication",
					"request": {
						"auth": {
							"type": "bearer",
							"bearer": [
								{
									"key": "token",
									"value": "{{tifa}}",
									"type": "string"
								}
							]
						},
						"method": "POST",
						"header": [],
						"body": {
							"mode": "raw",
							"raw": "{\r\n    \"email\": \"ramenhokage@konoha.com\",\r\n    \"password\": \"dattebayo\"\r\n}",
							"options": {
								"raw": {
									"language": "json"
								}
							}
						},
						"url": {
							"raw": "localhost:4000/user/login",
							"host": [
								"localhost"
							],
							"port": "4000",
							"path": [
								"user",
								"login"
							]
						}
					},
					"response": []
				},
				{
					"name": "View own profile",
					"request": {
						"auth": {
							"type": "bearer",
							"bearer": [
								{
									"key": "token",
									"value": "{{naruto}}",
									"type": "string"
								}
							]
						},
						"method": "GET",
						"header": [],
						"url": {
							"raw": "localhost:4000/user/myProfile",
							"host": [
								"localhost"
							],
							"port": "4000",
							"path": [
								"user",
								"myProfile"
							]
						}
					},
					"response": []
				}
			]
		},
		{
			"name": "Product",
			"item": [
				{
					"name": "Create Product",
					"request": {
						"auth": {
							"type": "bearer",
							"bearer": [
								{
									"key": "token",
									"value": "{{ginAdmin}}",
									"type": "string"
								}
							]
						},
						"method": "POST",
						"header": [],
						"body": {
							"mode": "raw",
							"raw": "{\r\n    \"name\": \"Korean sauce\",\r\n    \"description\": \"Made with spicy gochujang!\",\r\n    \"price\": 0,\r\n    \"class\": \"sauce\"\r\n}",
							"options": {
								"raw": {
									"language": "json"
								}
							}
						},
						"url": {
							"raw": "localhost:4000/product/create",
							"host": [
								"localhost"
							],
							"port": "4000",
							"path": [
								"product",
								"create"
							]
						}
					},
					"response": []
				},
				{
					"name": "View full menu",
					"request": {
						"method": "GET",
						"header": [],
						"url": {
							"raw": "localhost:4000/product/menu",
							"host": [
								"localhost"
							],
							"port": "4000",
							"path": [
								"product",
								"menu"
							]
						}
					},
					"response": []
				},
				{
					"name": "View menu by categories (wok, toppings, sauce)",
					"request": {
						"method": "GET",
						"header": [],
						"url": {
							"raw": "localhost:4000/product/menu/sauce",
							"host": [
								"localhost"
							],
							"port": "4000",
							"path": [
								"product",
								"menu",
								"sauce"
							]
						}
					},
					"response": []
				},
				{
					"name": "View specified menu item",
					"request": {
						"method": "GET",
						"header": [],
						"url": {
							"raw": "localhost:4000/product/63e0bfa2609d5bdec8fc3a47",
							"host": [
								"localhost"
							],
							"port": "4000",
							"path": [
								"product",
								"63e0bfa2609d5bdec8fc3a47"
							]
						}
					},
					"response": []
				},
				{
					"name": "Updating a product",
					"request": {
						"auth": {
							"type": "bearer",
							"bearer": [
								{
									"key": "token",
									"value": "{{ginAdmin}}",
									"type": "string"
								}
							]
						},
						"method": "PUT",
						"header": [],
						"body": {
							"mode": "raw",
							"raw": "{\r\n    \"name\": \"Wok (Large)\",\r\n    \"description\": \"Handmade noodles cooked in your favorite sauce and topped with ingredients of your choice! Now available in large size!\",\r\n    \"price\": 160,\r\n    \"class\": \"wok\"\r\n}",
							"options": {
								"raw": {
									"language": "json"
								}
							}
						},
						"url": {
							"raw": "localhost:4000/product/edit/63e1a18dff5e2f4aec490d51",
							"host": [
								"localhost"
							],
							"port": "4000",
							"path": [
								"product",
								"edit",
								"63e1a18dff5e2f4aec490d51"
							]
						}
					},
					"response": []
				},
				{
					"name": "Archive a product (Update status availability)",
					"request": {
						"auth": {
							"type": "bearer",
							"bearer": [
								{
									"key": "token",
									"value": "{{ginAdmin}}",
									"type": "string"
								}
							]
						},
						"method": "PUT",
						"header": [],
						"body": {
							"mode": "raw",
							"raw": "{\r\n    \"isAvailable\": true\r\n}",
							"options": {
								"raw": {
									"language": "json"
								}
							}
						},
						"url": {
							"raw": "localhost:4000/product/archive/63e1a18dff5e2f4aec490d51",
							"host": [
								"localhost"
							],
							"port": "4000",
							"path": [
								"product",
								"archive",
								"63e1a18dff5e2f4aec490d51"
							]
						}
					},
					"response": []
				}
			]
		}
	],
	"variable": [
		{
			"key": "giorno",
			"value": "eyJhbGciOiJIUzI1NiIsInR5cCI6IkpXVCJ9.eyJfaWQiOiI2M2UwNzZjNGQyNjYwOGQ0OTdhMDM1Y2EiLCJlbWFpbCI6Imdpb3Jub2dpb3Zhbm5hQGRyZWFtLmNvbSIsImlzQWRtaW4iOmZhbHNlLCJpYXQiOjE2NzU2NzA5NzV9.-FNRpGHjcbniBTdg92hzVFKMYZ0RUfWeQdWEYXN1yVQ"
		},
		{
			"key": "ginAdmin",
			"value": "eyJhbGciOiJIUzI1NiIsInR5cCI6IkpXVCJ9.eyJfaWQiOiI2M2UwNzY4ZmQyNjYwOGQ0OTdhMDM1YzciLCJlbWFpbCI6ImdpbnRva2lAZ21haWwuY29tIiwiaXNBZG1pbiI6dHJ1ZSwiaWF0IjoxNjc1NjcxMDI5fQ.PxDRchyHMns2VPz7qM4a04A5y8DNb5jEl1ek2f9h7mI"
		},
		{
			"key": "tifa",
			"value": "eyJhbGciOiJIUzI1NiIsInR5cCI6IkpXVCJ9.eyJfaWQiOiI2M2UwNzZmMGQyNjYwOGQ0OTdhMDM1Y2UiLCJlbWFpbCI6InRsb2NraGVhcnRAN2hlYXZlbi5jb20iLCJpc0FkbWluIjpmYWxzZSwiaWF0IjoxNjc1NzM3NzE0fQ.sH3gF3Q-o2gesc7D7wbQAC7vRpyu8Q0GIBuL3uU9gXc"
		},
		{
			"key": "naruto",
			"value": "eyJhbGciOiJIUzI1NiIsInR5cCI6IkpXVCJ9.eyJfaWQiOiI2M2UxYmQwMTNlMmFiN2U1ODVjYjFlNzAiLCJlbWFpbCI6InJhbWVuaG9rYWdlQGtvbm9oYS5jb20iLCJpc0FkbWluIjpmYWxzZSwiaWF0IjoxNjc1NzM4Mzg3fQ.3iZ9KoxC2vbh7l5WsGBMkRT9id9V2PkFa34hjWj30NI"
		}
	]
}