{
	"info": {
		"_postman_id": "2df1dca9-4903-43ce-9d74-1b56e425ae8d",
		"name": "Course Booking API",
		"schema": "https://schema.getpostman.com/json/collection/v2.1.0/collection.json",
		"_exporter_id": "25584857"
	},
	"item": [
		{
			"name": "Users",
			"item": []
		},
		{
			"name": "Courses",
			"item": [
				{
					"name": "Add a Course",
					"request": {
						"auth": {
							"type": "bearer",
							"bearer": [
								{
									"key": "token",
									"value": "eyJhbGciOiJIUzI1NiIsInR5cCI6IkpXVCJ9.eyJfaWQiOiI2M2RjYmYyYjdlZjA3Y2RlNzdjZDc2Y2IiLCJlbWFpbCI6ImFkbWluQG1haWwuY29tIiwiaXNBZG1pbiI6dHJ1ZSwiaWF0IjoxNjc1NDIwMzE1fQ.voNQ0QyiB3mza5hiQrRN9rjHPZRlgz8vMUyKUhx4dUI",
									"type": "string"
								}
							]
						},
						"method": "POST",
						"header": [],
						"body": {
							"mode": "raw",
							"raw": "{\r\n    \"name\": \"CSS\",\r\n    \"description\": \"Let's make our websites look cooler.\",\r\n    \"price\": 500\r\n}",
							"options": {
								"raw": {
									"language": "json"
								}
							}
						},
						"url": {
							"raw": "localhost:3001/course",
							"host": [
								"localhost"
							],
							"port": "3001",
							"path": [
								"course"
							]
						}
					},
					"response": []
				}
			]
		},
		{
			"name": "POST \"userRegistration\"",
			"request": {
				"method": "POST",
				"header": [],
				"body": {
					"mode": "raw",
					"raw": "{\r\n    \"firstName\": \"admin\",\r\n    \"lastName\": \"admin\",\r\n    \"email\": \"admin@mail.com\",\r\n    \"password\": \"admin\",\r\n    \"mobileNo\": \"0987654321\"\r\n}",
					"options": {
						"raw": {
							"language": "json"
						}
					}
				},
				"url": {
					"raw": "localhost:3001/user/register",
					"host": [
						"localhost"
					],
					"port": "3001",
					"path": [
						"user",
						"register"
					]
				}
			},
			"response": []
		},
		{
			"name": "POST \"userAuthentication\"",
			"request": {
				"method": "POST",
				"header": [],
				"body": {
					"mode": "raw",
					"raw": "{\r\n    \"email\": \"admin@mail.com\",\r\n    \"password\": \"admin\"\r\n}",
					"options": {
						"raw": {
							"language": "json"
						}
					}
				},
				"url": {
					"raw": "localhost:3001/user/login",
					"host": [
						"localhost"
					],
					"port": "3001",
					"path": [
						"user",
						"login"
					]
				}
			},
			"response": []
		},
		{
			"name": "POST \"retrieve user details\"",
			"request": {
				"auth": {
					"type": "bearer",
					"bearer": [
						{
							"key": "token",
							"value": "eyJhbGciOiJIUzI1NiIsInR5cCI6IkpXVCJ9.eyJfaWQiOiI2M2RjODQ1NDE5MTcxZDcwMzMzM2NlNmMiLCJlbWFpbCI6ImFubmVAbWFpbC5jb20iLCJpc0FkbWluIjpmYWxzZSwiaWF0IjoxNjc1NDA2NjgxfQ.9BlpKMsqWUHWDufA0r0DdwumJdWY7beJkgq7fzICKqE",
							"type": "string"
						}
					]
				},
				"method": "GET",
				"header": [],
				"url": {
					"raw": "localhost:3001/user/details",
					"host": [
						"localhost"
					],
					"port": "3001",
					"path": [
						"user",
						"details"
					]
				}
			},
			"response": []
		}
	]
}