{
	"info": {
		"_postman_id": "77e0c527-ae92-4eb6-85b9-701526755fa7",
		"name": "s34 Activity",
		"schema": "https://schema.getpostman.com/json/collection/v2.1.0/collection.json",
		"_exporter_id": "18899987"
	},
	"item": [
		{
			"name": "GET\"/home\"",
			"request": {
				"method": "GET",
				"header": [],
				"url": {
					"raw": "localhost:4000/home",
					"host": [
						"localhost"
					],
					"port": "4000",
					"path": [
						"home"
					]
				}
			},
			"response": []
		},
		{
			"name": "GET \"/items\"",
			"request": {
				"method": "GET",
				"header": [],
				"url": {
					"raw": "localhost:4000/items",
					"host": [
						"localhost"
					],
					"port": "4000",
					"path": [
						"items"
					]
				}
			},
			"response": []
		},
		{
			"name": "DELETE \"/delete-item\"",
			"request": {
				"method": "DELETE",
				"header": [],
				"url": {
					"raw": "localhost:4000/delete-item",
					"host": [
						"localhost"
					],
					"port": "4000",
					"path": [
						"delete-item"
					]
				}
			},
			"response": []
		}
	]
}