{
	"info": {
		"_postman_id": "e6c3661b-dd49-4967-ab57-3ae0efecb0d3",
		"name": "Tinderella",
		"schema": "https://schema.getpostman.com/json/collection/v2.1.0/collection.json",
		"_exporter_id": "25584855"
	},
	"item": [
		{
			"name": "Users",
			"item": [
				{
					"name": "POST \"userRegistration\"",
					"request": {
						"method": "POST",
						"header": [],
						"body": {
							"mode": "raw",
							"raw": "{\r\n    \"username\": \"morpix\",\r\n    \"email\": \"morpix@mail.com\",\r\n    \"password\": \"morpix17\"\r\n}",
							"options": {
								"raw": {
									"language": "json"
								}
							}
						},
						"url": {
							"raw": "localhost:3001/user/register",
							"host": [
								"localhost"
							],
							"port": "3001",
							"path": [
								"user",
								"register"
							]
						}
					},
					"response": []
				},
				{
					"name": "POST \"userAuthentication\"",
					"request": {
						"method": "POST",
						"header": [],
						"body": {
							"mode": "raw",
							"raw": "{\r\n    \"email\": \"morpix@mail.com\",\r\n    \"password\": \"morpix17\"\r\n}",
							"options": {
								"raw": {
									"language": "json"
								}
							}
						},
						"url": {
							"raw": "localhost:3001/user/login",
							"host": [
								"localhost"
							],
							"port": "3001",
							"path": [
								"user",
								"login"
							]
						}
					},
					"response": []
				},
				{
					"name": "GET \"userDetails\"",
					"request": {
						"auth": {
							"type": "bearer",
							"bearer": [
								{
									"key": "token",
									"value": "eyJhbGciOiJIUzI1NiIsInR5cCI6IkpXVCJ9.eyJfaWQiOiI2M2YyMTUyYWY4ZWIwZDg0Yzc1MGJjZTUiLCJlbWFpbCI6Im1vcnBpeEBtYWlsLmNvbSIsImlzQWRtaW4iOnRydWUsImlhdCI6MTY3Njg3MzUzNn0.Bd6sfUBL-f2L7TLw4cWiqaqLOHEwzlWiEG5045MS1uA",
									"type": "string"
								}
							]
						},
						"method": "GET",
						"header": [],
						"url": {
							"raw": "localhost:3001/user/details",
							"host": [
								"localhost"
							],
							"port": "3001",
							"path": [
								"user",
								"details"
							]
						}
					},
					"response": []
				}
			]
		},
		{
			"name": "Products",
			"item": [
				{
					"name": "POST \"addProduct\"",
					"request": {
						"auth": {
							"type": "bearer",
							"bearer": [
								{
									"key": "token",
									"value": "eyJhbGciOiJIUzI1NiIsInR5cCI6IkpXVCJ9.eyJfaWQiOiI2M2YyMTUyYWY4ZWIwZDg0Yzc1MGJjZTUiLCJlbWFpbCI6Im1vcnBpeEBtYWlsLmNvbSIsImlzQWRtaW4iOnRydWUsImlhdCI6MTY3Njg1Mjg4OX0.F_T7AfM2u1thnG4k4cWs93E7fqHPEGa96uEdHdv9OLc",
									"type": "string"
								}
							]
						},
						"method": "POST",
						"header": [],
						"body": {
							"mode": "raw",
							"raw": "{\r\n    \"image\": \"https://res.cloudinary.com/dm2aaqucx/image/upload/v1676852550/46_mulwck.png\",\r\n    \"name\": \"Star\",\r\n    \"description\": \"Kid's shirt\",\r\n    \"price\": 199\r\n}",
							"options": {
								"raw": {
									"language": "json"
								}
							}
						},
						"url": {
							"raw": "localhost:3001/product/addProduct",
							"host": [
								"localhost"
							],
							"port": "3001",
							"path": [
								"product",
								"addProduct"
							]
						}
					},
					"response": []
				},
				{
					"name": "GET \"allProducts\"",
					"request": {
						"auth": {
							"type": "bearer",
							"bearer": [
								{
									"key": "token",
									"value": "eyJhbGciOiJIUzI1NiIsInR5cCI6IkpXVCJ9.eyJfaWQiOiI2M2YyMTUyYWY4ZWIwZDg0Yzc1MGJjZTUiLCJlbWFpbCI6Im1vcnBpeEBtYWlsLmNvbSIsImlzQWRtaW4iOnRydWUsImlhdCI6MTY3Njg1Mjg4OX0.F_T7AfM2u1thnG4k4cWs93E7fqHPEGa96uEdHdv9OLc",
									"type": "string"
								}
							]
						},
						"method": "GET",
						"header": [],
						"url": {
							"raw": "localhost:3001/product/allProducts",
							"host": [
								"localhost"
							],
							"port": "3001",
							"path": [
								"product",
								"allProducts"
							]
						}
					},
					"response": []
				}
			]
		},
		{
			"name": "Orders",
			"item": []
		},
		{
			"name": "Cart",
			"item": []
		}
	]
}