{
	"info": {
		"_postman_id": "22b52e7d-dcf9-4ade-9bf8-e9f7b37e788e",
		"name": "Course Booking API",
		"schema": "https://schema.getpostman.com/json/collection/v2.1.0/collection.json",
		"_exporter_id": "25178623"
	},
	"item": [
		{
			"name": "POST 'User Registration'",
			"request": {
				"method": "POST",
				"header": [],
				"body": {
					"mode": "raw",
					"raw": "{\r\n    \"firstName\" : \"Alex\",\r\n    \"lastName\" : \"Poe\",\r\n    \"email\" : \"alex@mail.com\",\r\n    \"password\": \"poe55\",\r\n    \"mobileNo\": \"0998765432\"\r\n}",
					"options": {
						"raw": {
							"language": "json"
						}
					}
				},
				"url": {
					"raw": "localhost:3001/user/register",
					"host": [
						"localhost"
					],
					"port": "3001",
					"path": [
						"user",
						"register"
					]
				}
			},
			"response": []
		},
		{
			"name": "POST 'User Authentication'",
			"request": {
				"method": "POST",
				"header": [],
				"body": {
					"mode": "raw",
					"raw": "{\r\n    \"firstName\" : \"Alex\",\r\n    \"lastName\" : \"Poe\",\r\n    \"email\" : \"alex@mail.com\",\r\n    \"password\": \"poe55\",\r\n    \"mobileNo\": \"0998765432\"\r\n}",
					"options": {
						"raw": {
							"language": "json"
						}
					}
				},
				"url": {
					"raw": "localhost:3001/user/login",
					"host": [
						"localhost"
					],
					"port": "3001",
					"path": [
						"user",
						"login"
					]
				}
			},
			"response": []
		},
		{
			"name": "GET 'All User'",
			"request": {
				"method": "GET",
				"header": [],
				"url": {
					"raw": "localhost:3001/user/",
					"host": [
						"localhost"
					],
					"port": "3001",
					"path": [
						"user",
						""
					]
				}
			},
			"response": []
		},
		{
			"name": "POST 'Retrieve User'",
			"request": {
				"method": "POST",
				"header": [],
				"body": {
					"mode": "raw",
					"raw": "{\r\n     \"_id\": \"63db8298e926819a20cd115b\"\r\n}",
					"options": {
						"raw": {
							"language": "json"
						}
					}
				},
				"url": {
					"raw": "localhost:3001/user/details",
					"host": [
						"localhost"
					],
					"port": "3001",
					"path": [
						"user",
						"details"
					]
				}
			},
			"response": []
		}
	]
}