{
	"info": {
		"_postman_id": "d43a137c-5ec7-437d-8c77-6258c30338c2",
		"name": "Course Booking API",
		"schema": "https://schema.getpostman.com/json/collection/v2.1.0/collection.json",
		"_exporter_id": "25584859"
	},
	"item": [
		{
			"name": "Users",
			"item": [
				{
					"name": "POST \"userRegistration\"",
					"request": {
						"method": "POST",
						"header": [],
						"body": {
							"mode": "raw",
							"raw": "{\r\n    \"firstName\":\"Jane\",\r\n    \"lastName\":\"Doe\",\r\n    \"email\":\"jane@mail.com\",\r\n    \"password\":\"bossmapagmahal\",\r\n    \"mobileNo\":\"0987654321\"\r\n\r\n}",
							"options": {
								"raw": {
									"language": "json"
								}
							}
						},
						"url": {
							"raw": "localhost:3001/user/register",
							"host": [
								"localhost"
							],
							"port": "3001",
							"path": [
								"user",
								"register"
							]
						}
					},
					"response": []
				},
				{
					"name": "POST \"userAuthentication\"",
					"request": {
						"method": "POST",
						"header": [],
						"body": {
							"mode": "raw",
							"raw": "{\r\n    \"email\" : \"sernsern.dunglao@mail.com\",\r\n    \"password\" : \"dungzsern\"\r\n}",
							"options": {
								"raw": {
									"language": "json"
								}
							}
						},
						"url": {
							"raw": "localhost:3001/user/login",
							"host": [
								"localhost"
							],
							"port": "3001",
							"path": [
								"user",
								"login"
							]
						}
					},
					"response": []
				},
				{
					"name": "GET  \"userAccount\" - activity",
					"request": {
						"auth": {
							"type": "bearer",
							"bearer": [
								{
									"key": "token",
									"value": "eyJhbGciOiJIUzI1NiIsInR5cCI6IkpXVCJ9.eyJfaWQiOiI2M2RjNjhhNTEwNDI1ODhlOTMyZmYzNGQiLCJlbWFpbCI6InNlcm5zZXJuLmR1bmdsYW9AbWFpbC5jb20iLCJpc0FkbWluIjpmYWxzZSwiaWF0IjoxNjc1NDAzMDU0fQ.A-riT58uvaqB7tzs1BD6kXxy1w7D_osaWJtFd6o0p4c",
									"type": "string"
								}
							]
						},
						"method": "GET",
						"header": [],
						"url": {
							"raw": "localhost:3001/user/details",
							"host": [
								"localhost"
							],
							"port": "3001",
							"path": [
								"user",
								"details"
							]
						}
					},
					"response": []
				}
			]
		},
		{
			"name": "Courses",
			"item": [
				{
					"name": "Add a course",
					"request": {
						"auth": {
							"type": "bearer",
							"bearer": [
								{
									"key": "token",
									"value": "eyJhbGciOiJIUzI1NiIsInR5cCI6IkpXVCJ9.eyJfaWQiOiI2M2RjYmVhYzkwYjg4OTdmNjcxNGFmODYiLCJlbWFpbCI6ImFkbWluLmFkbWluQG1haWwuY29tIiwiaXNBZG1pbiI6dHJ1ZSwiaWF0IjoxNjc1NDEyMjAyfQ.LQiUmwTOL2LJD0xUWb7PEH7FAOrPDp59cmdo7kALtlY",
									"type": "string"
								}
							]
						},
						"method": "POST",
						"header": [],
						"body": {
							"mode": "raw",
							"raw": "{\r\n    \"name\": \"JavaScript\",\r\n    \"description\": \"Learn how to use JavaScript for your website\",\r\n    \"price\": 1000\r\n}",
							"options": {
								"raw": {
									"language": "json"
								}
							}
						},
						"url": {
							"raw": "localhost:3001/course/",
							"host": [
								"localhost"
							],
							"port": "3001",
							"path": [
								"course",
								""
							]
						}
					},
					"response": []
				}
			]
		}
	]
}