{
	"info": {
		"_postman_id": "291339f3-b9ae-4f92-91e3-be1e3088f470",
		"name": "Course Booking API",
		"schema": "https://schema.getpostman.com/json/collection/v2.1.0/collection.json",
		"_exporter_id": "25236308"
	},
	"item": [
		{
			"name": "userRegistration",
			"request": {
				"method": "POST",
				"header": [],
				"body": {
					"mode": "raw",
					"raw": "{\r\n    \"firstName\" : \"jogn\",\r\n    \"lastName\" : \"Doe\",\r\n    \"email\" : \"John@mail1.com\",\r\n    \"password\" : \"bossmapagmahal\",\r\n    \"mobileNo\" : \"1234567890\"\r\n}",
					"options": {
						"raw": {
							"language": "json"
						}
					}
				},
				"url": {
					"raw": "localhost:3002/user/register",
					"host": [
						"localhost"
					],
					"port": "3002",
					"path": [
						"user",
						"register"
					]
				}
			},
			"response": []
		},
		{
			"name": "POST \"/userAuthentication\"",
			"request": {
				"method": "POST",
				"header": [],
				"body": {
					"mode": "raw",
					"raw": "{\r\n    \"email\" : \"jane@mail.com\",\r\n    \"password\" : \"bossmapagmahal\"\r\n}",
					"options": {
						"raw": {
							"language": "json"
						}
					}
				},
				"url": {
					"raw": "localhost:3002/user/login",
					"host": [
						"localhost"
					],
					"port": "3002",
					"path": [
						"user",
						"login"
					]
				}
			},
			"response": []
		},
		{
			"name": "POST \"/details\"",
			"request": {
				"method": "POST",
				"header": [],
				"body": {
					"mode": "raw",
					"raw": "{\r\n    \"id\" : \"63db7e7690e504b6df0ec787\"\r\n}",
					"options": {
						"raw": {
							"language": "json"
						}
					}
				},
				"url": {
					"raw": "localhost:3002/user/details",
					"host": [
						"localhost"
					],
					"port": "3002",
					"path": [
						"user",
						"details"
					]
				}
			},
			"response": []
		}
	]
}