{
	"info": {
		"_postman_id": "eaba65e6-775b-41cd-8de4-6634e2e74809",
		"name": "s36",
		"schema": "https://schema.getpostman.com/json/collection/v2.1.0/collection.json",
		"_exporter_id": "25236308"
	},
	"item": [
		{
			"name": "GET \"/tasks\"",
			"request": {
				"method": "GET",
				"header": [],
				"url": {
					"raw": "localhost:3001/tasks/get",
					"host": [
						"localhost"
					],
					"port": "3001",
					"path": [
						"tasks",
						"get"
					]
				}
			},
			"response": []
		},
		{
			"name": "POST \"createTask\"",
			"request": {
				"method": "POST",
				"header": [],
				"body": {
					"mode": "raw",
					"raw": "{\r\n    \"name\" : \"playing\"\r\n}",
					"options": {
						"raw": {
							"language": "json"
						}
					}
				},
				"url": {
					"raw": "localhost:3001/tasks/addTask",
					"host": [
						"localhost"
					],
					"port": "3001",
					"path": [
						"tasks",
						"addTask"
					]
				}
			},
			"response": []
		},
		{
			"name": "New Request",
			"request": {
				"method": "DELETE",
				"header": [],
				"url": {
					"raw": "DELETE",
					"host": [
						"DELETE"
					]
				}
			},
			"response": []
		},
		{
			"name": "GET \"/id\"",
			"request": {
				"method": "GET",
				"header": [],
				"url": {
					"raw": "localhost:3001/tasks/63db2359d4fa521f7658a95b",
					"host": [
						"localhost"
					],
					"port": "3001",
					"path": [
						"tasks",
						"63db2359d4fa521f7658a95b"
					]
				}
			},
			"response": []
		},
		{
			"name": "PUT \"/status\"",
			"request": {
				"method": "PUT",
				"header": []
			},
			"response": []
		}
	]
}