{
	"info": {
		"_postman_id": "8a113989-283d-4689-be2a-5a551035bc90",
		"name": "s36",
		"schema": "https://schema.getpostman.com/json/collection/v2.1.0/collection.json",
		"_exporter_id": "25180869"
	},
	"item": [
		{
			"name": "POST \"createTask\"",
			"request": {
				"method": "POST",
				"header": [],
				"body": {
					"mode": "raw",
					"raw": "{\n    \"name\" : \"Playing\"\n}",
					"options": {
						"raw": {
							"language": "json"
						}
					}
				},
				"url": {
					"raw": "localhost:3001/tasks/addTask",
					"host": [
						"localhost"
					],
					"port": "3001",
					"path": [
						"tasks",
						"addTask"
					]
				}
			},
			"response": []
		},
		{
			"name": "POST \"/tasks\"",
			"request": {
				"method": "GET",
				"header": []
			},
			"response": []
		},
		{
			"name": "DELETE \"delete/:id\"",
			"request": {
				"method": "DELETE",
				"header": []
			},
			"response": []
		},
		{
			"name": "GET \"/:id\"",
			"request": {
				"method": "GET",
				"header": []
			},
			"response": []
		},
		{
			"name": "New Request",
			"request": {
				"method": "GET",
				"header": []
			},
			"response": []
		}
	]
}