{
	"info": {
		"_postman_id": "360cfec3-9adc-4e65-8e09-b66294a263e4",
		"name": "Noah_Store_API",
		"schema": "https://schema.getpostman.com/json/collection/v2.1.0/collection.json",
		"_exporter_id": "25180869"
	},
	"item": [
		{
			"name": "USER REQUEST",
			"item": [
				{
					"name": "POST \"/register\"",
					"request": {
						"method": "POST",
						"header": [],
						"body": {
							"mode": "raw",
							"raw": "{\n    \"username\":\"admin\",\n    \"email\":\"admin@gmail.com\",\n    \"password\": \"admin\"\n}",
							"options": {
								"raw": {
									"language": "json"
								}
							}
						},
						"url": {
							"raw": "localhost:3000/users/register",
							"host": [
								"localhost"
							],
							"port": "3000",
							"path": [
								"users",
								"register"
							]
						}
					},
					"response": []
				},
				{
					"name": "POST \"/login\"",
					"request": {
						"method": "POST",
						"header": [],
						"body": {
							"mode": "raw",
							"raw": "{\n    \"email\":\"sun@gmail.com\",\n    \"password\":\"sun\"\n}",
							"options": {
								"raw": {
									"language": "json"
								}
							}
						},
						"url": {
							"raw": "localhost:3000/users/login",
							"host": [
								"localhost"
							],
							"port": "3000",
							"path": [
								"users",
								"login"
							]
						}
					},
					"response": []
				},
				{
					"name": "PUT \"/userUpdate\"",
					"request": {
						"auth": {
							"type": "bearer",
							"bearer": [
								{
									"key": "token",
									"value": "eyJhbGciOiJIUzI1NiIsInR5cCI6IkpXVCJ9.eyJfaWQiOiI2M2UxMzkzZmU1YTEwODhhNDYxYTE3MDciLCJlbWFpbCI6Imtlbm5ldGgyQGdtYWlsLmNvbSIsImlzQWRtaW4iOmZhbHNlLCJpYXQiOjE2NzU3MDQ4MjJ9.ePI4YflJLVIxbrRlikXwMtDsrLySiNP1sYHezAyJV4E",
									"type": "string"
								}
							]
						},
						"method": "PUT",
						"header": [],
						"body": {
							"mode": "raw",
							"raw": "{\n    \"username\":\"louie\"\n}",
							"options": {
								"raw": {
									"language": "json"
								}
							}
						},
						"url": {
							"raw": "localhost:3000/users/63e099528ffd0c66cb257a7c",
							"host": [
								"localhost"
							],
							"port": "3000",
							"path": [
								"users",
								"63e099528ffd0c66cb257a7c"
							]
						}
					},
					"response": []
				},
				{
					"name": "GET \"/getUser\" admin only",
					"request": {
						"auth": {
							"type": "bearer",
							"bearer": [
								{
									"key": "token",
									"value": "{{user}}",
									"type": "string"
								}
							]
						},
						"method": "GET",
						"header": [],
						"url": {
							"raw": "localhost:3000/api/find/qwe123214",
							"host": [
								"localhost"
							],
							"port": "3000",
							"path": [
								"api",
								"find",
								"qwe123214"
							]
						}
					},
					"response": []
				},
				{
					"name": "GET \"/getAllUsers\" Admin only",
					"request": {
						"method": "GET",
						"header": []
					},
					"response": []
				},
				{
					"name": "GET \"/usersSTATISTICS\"",
					"request": {
						"method": "GET",
						"header": []
					},
					"response": []
				}
			]
		}
	],
	"variable": [
		{
			"key": "adminRole",
			"value": "eyJhbGciOiJIUzI1NiIsInR5cCI6IkpXVCJ9.eyJfaWQiOiI2M2UxNDRmYTQ1ZTM5ZDcxYzJlZWNmNWYiLCJlbWFpbCI6ImFkbWluQGdtYWlsLmNvbSIsImlzQWRtaW4iOnRydWUsImlhdCI6MTY3NTcwNzY3MX0.fQ-l-U5fZDsCtruJDrKv0O8xvwM7TggK4bYDoRuEJOI"
		},
		{
			"key": "user",
			"value": "eyJhbGciOiJIUzI1NiIsInR5cCI6IkpXVCJ9.eyJfaWQiOiI2M2UxNDI4MjZjNWMxYzhkYWQ2OTUxYWEiLCJlbWFpbCI6InN1bkBnbWFpbC5jb20iLCJpc0FkbWluIjpmYWxzZSwiaWF0IjoxNjc1NzA5MTM5fQ.HaPmuI9NKkr8zGTcJ-S1tler1PAaU0aemo8iIlGxfvk"
		}
	]
}