{
	"info": {
		"_postman_id": "0e24d772-881b-43f1-a780-54e4f76b7e7c",
		"name": "s35 activity",
		"schema": "https://schema.getpostman.com/json/collection/v2.1.0/collection.json",
		"_exporter_id": "25584853"
	},
	"item": [
		{
			"name": "POST \"/signup\"",
			"request": {
				"method": "POST",
				"header": [],
				"body": {
					"mode": "raw",
					"raw": "{\r\n    \"username\": \"windel\",\r\n    \"password\": \"cancejo\"\r\n}",
					"options": {
						"raw": {
							"language": "json"
						}
					}
				},
				"url": {
					"raw": "localhost:3001/signup",
					"host": [
						"localhost"
					],
					"port": "3001",
					"path": [
						"signup"
					]
				}
			},
			"response": []
		}
	]
}