{
	"info": {
		"_postman_id": "073562fe-2a6e-41cd-8ad0-8f392c5ffd46",
		"name": "s36",
		"schema": "https://schema.getpostman.com/json/collection/v2.1.0/collection.json",
		"_exporter_id": "25584842"
	},
	"item": [
		{
			"name": "Discussion",
			"item": [
				{
					"name": "GET \"/tasks\"",
					"request": {
						"method": "GET",
						"header": [],
						"url": {
							"raw": "localhost:3001/tasks/",
							"host": [
								"localhost"
							],
							"port": "3001",
							"path": [
								"tasks",
								""
							]
						}
					},
					"response": []
				},
				{
					"name": "POST \"/addTask\"",
					"request": {
						"method": "POST",
						"header": [],
						"body": {
							"mode": "raw",
							"raw": "{\r\n    \"name\" : \"playing\"\r\n}",
							"options": {
								"raw": {
									"language": "json"
								}
							}
						},
						"url": {
							"raw": "localhost:3001/tasks/addTask",
							"host": [
								"localhost"
							],
							"port": "3001",
							"path": [
								"tasks",
								"addTask"
							]
						}
					},
					"response": []
				},
				{
					"name": "DELETE \"/deleteTasks/:id\"",
					"request": {
						"method": "DELETE",
						"header": [],
						"url": {
							"raw": "localhost:3001/tasks/deleteTasks/63da0d72bc21890c532ebafb",
							"host": [
								"localhost"
							],
							"port": "3001",
							"path": [
								"tasks",
								"deleteTasks",
								"63da0d72bc21890c532ebafb"
							]
						}
					},
					"response": []
				}
			]
		},
		{
			"name": "Activity",
			"item": [
				{
					"name": "GET \"/tasks/:id\"",
					"request": {
						"method": "GET",
						"header": [],
						"url": {
							"raw": "localhost:3001/tasks/63da185fac2387e53912b5a0",
							"host": [
								"localhost"
							],
							"port": "3001",
							"path": [
								"tasks",
								"63da185fac2387e53912b5a0"
							]
						}
					},
					"response": []
				},
				{
					"name": "PUT \"/tasks/:id\"",
					"request": {
						"method": "PUT",
						"header": [],
						"body": {
							"mode": "raw",
							"raw": "",
							"options": {
								"raw": {
									"language": "json"
								}
							}
						},
						"url": {
							"raw": "localhost:3001/tasks/63da185fac2387e53912b5a0/complete",
							"host": [
								"localhost"
							],
							"port": "3001",
							"path": [
								"tasks",
								"63da185fac2387e53912b5a0",
								"complete"
							]
						}
					},
					"response": []
				}
			]
		}
	]
}