{
	"info": {
		"_postman_id": "5fdc0d11-ad6f-4939-b736-a31269df1d2e",
		"name": "s33-ACT-API",
		"schema": "https://schema.getpostman.com/json/collection/v2.1.0/collection.json"
	},
	"item": [
		{
			"name": "GET1",
			"request": {
				"method": "GET",
				"header": []
			},
			"response": []
		},
		{
			"name": "GET2",
			"request": {
				"method": "GET",
				"header": []
			},
			"response": []
		},
		{
			"name": "POST1",
			"request": {
				"method": "GET",
				"header": []
			},
			"response": []
		},
		{
			"name": "PUT1",
			"request": {
				"method": "GET",
				"header": []
			},
			"response": []
		},
		{
			"name": "PATCH1",
			"request": {
				"method": "GET",
				"header": []
			},
			"response": []
		},
		{
			"name": "DELETE1",
			"request": {
				"method": "GET",
				"header": []
			},
			"response": []
		}
	]
}