{
	"_id": "232hbfhvkb232skfb56kjbf",
	"name": "HTML",
	"description": "Learn the basics and how to code",
	"price": 1000,
	"isActive": true,
	"slots": 20,
	"enrollees": ["58ebfjebfb93739fvbcj374hfbv"],
	"dateTimeCreated": "1990-01-01T15:00:00.00Z"

}

{
	"_id": "823bfvf8923fbjbv23bfbv23gdf",
	"name": "CSS",
	"description": "Let's make our application look cool!",
	"price": 2000,
	"isActive": false,
	"slots": 20,
	"enrollees": ["58ebfjebfb93739fvbcj374hfbv"],
	"dateTimeCreated": "1990-01-01T15:00:00.00Z"

}

{
	"_id": "274bfdv3undkbf9325jhfhb87",
	"name": "JavaScript",
	"description": "Makes websites fun and interactive",
	"price": 4000,
	"isActive": true,
	"slots": 15,
	"enrollees": [],
	"dateTimeCreated": "1990-01-01T15:00:00.00Z"

}