{
	"_id": "58ebfjebfb93739fvbcj374hfbv",
	"firstName": "Onkar",
	"lastName": "Yewale",
	"email": "o.p.yewale@gmail.com",
	"password": "onkaryewale",
	"isAdmin": false,
	"mobileNumber": "919099995758",
	"enrollments": ["232hbfhvkb232skfb56kjbf", "823bfvf8923fbjbv23bfbv23gdf"],
	"dateTimeRegistered": "2020-15-11T00:00:00.00Z"
}

{
	"_id": "8234dvhjhfvf384vbb34bfhjb34",
	"firstName": "Aarush",
	"lastName": "Yewale",
	"email": "aarush.yewale@gmail.com",
	"password": "yewaleaarush",
	"isAdmin": true,
	"mobileNumber": "917276824147",
	"enrollments": [],
	"dateTimeRegistered": "2020-13-11T00:00:00.00Z"
}