{
	"_id": "76ghjbhb687jhvm89hjvmug89",
	"userId": "58ebfjebfb93739fvbcj374hfbv",
	"courseId": "232hbfhvkb232skfb56kjbf",
	"isPaid": true,
	"paymentMethod": "Paypal",
	"dateTimeCreated": "2020-16-11T00:00:00.00Z"
}

{
	"_id": "865vbmv9897hfc4hgfcgv6467",
	"userId": "58ebfjebfb93739fvbcj374hfbv",
	"courseId": "823bfvf8923fbjbv23bfbv23gdf",
	"isPaid": true,
	"paymentMethod": "Paypal",
	"dateTimeCreated": "2020-16-11T00:00:00.00Z"
}