{
	"info": {
		"_postman_id": "cf7221ca-7f81-4845-b544-6f533eb975a3",
		"name": "capstone2",
		"schema": "https://schema.getpostman.com/json/collection/v2.1.0/collection.json",
		"_exporter_id": "24988338"
	},
	"item": [
		{
			"name": "registerUser",
			"request": {
				"method": "POST",
				"header": [],
				"body": {
					"mode": "raw",
					"raw": "{\r\n    \"email\":\"ram@123\",\r\n    \"password\":\"ram123\"\r\n\r\n}",
					"options": {
						"raw": {
							"language": "json"
						}
					}
				},
				"url": {
					"raw": "localhost:4000/users/register",
					"host": [
						"localhost"
					],
					"port": "4000",
					"path": [
						"users",
						"register"
					]
				}
			},
			"response": []
		},
		{
			"name": "user Authenticatication",
			"request": {
				"auth": {
					"type": "bearer",
					"bearer": [
						{
							"key": "token",
							"value": "eyJhbGciOiJIUzI1NiIsInR5cCI6IkpXVCJ9.eyJpZCI6IjY0MDJjNTNlZDY3ODJlYzNiNDM3NTMzZiIsImVtYWlsIjoieW9nZW5kcmFAMTIzLmNvbSIsImlzQWRtaW4iOnRydWUsImlhdCI6MTY3NzkzOTkxN30.HzNuoaRD6cq2PeEowdrwD4zUePUtkBTaGYiVCejx6Ac",
							"type": "string"
						}
					]
				},
				"method": "POST",
				"header": [],
				"body": {
					"mode": "raw",
					"raw": "{\r\n    \"email\":\"rishi@123\",\r\n    \"password\":\"rishi123\"\r\n}",
					"options": {
						"raw": {
							"language": "json"
						}
					}
				},
				"url": {
					"raw": "localhost:4000/users/login",
					"host": [
						"localhost"
					],
					"port": "4000",
					"path": [
						"users",
						"login"
					]
				}
			},
			"response": []
		},
		{
			"name": "create product",
			"request": {
				"auth": {
					"type": "bearer",
					"bearer": [
						{
							"key": "token",
							"value": "eyJhbGciOiJIUzI1NiIsInR5cCI6IkpXVCJ9.eyJpZCI6IjY0MDYwMjlhZmJlNzk1NzQ0YTE5ZmIwOCIsImVtYWlsIjoicmlzaGlAMTIzIiwiaXNBZG1pbiI6dHJ1ZSwiaWF0IjoxNjc4MTk4MzgzfQ.ybq0hSh8CgvELEnJX8nDE2UzaE9QWj8N9w2OMw3lJ4Q",
							"type": "string"
						}
					]
				},
				"method": "POST",
				"header": [],
				"body": {
					"mode": "raw",
					"raw": "{\r\n    \"name\":\"samsung\",\r\n    \"description\":\"xyz\",\r\n    \"price\":\"55000\"\r\n\r\n}",
					"options": {
						"raw": {
							"language": "json"
						}
					}
				},
				"url": {
					"raw": "localhost:4000/products/add",
					"host": [
						"localhost"
					],
					"port": "4000",
					"path": [
						"products",
						"add"
					]
				}
			},
			"response": []
		},
		{
			"name": "get active products",
			"request": {
				"method": "GET",
				"header": [],
				"url": {
					"raw": "localhost:4000/products/active",
					"host": [
						"localhost"
					],
					"port": "4000",
					"path": [
						"products",
						"active"
					]
				}
			},
			"response": []
		},
		{
			"name": "get specific product",
			"request": {
				"method": "GET",
				"header": [],
				"url": {
					"raw": "localhost:4000/products/640b50fe9d24e411c2283e7a",
					"host": [
						"localhost"
					],
					"port": "4000",
					"path": [
						"products",
						"640b50fe9d24e411c2283e7a"
					]
				}
			},
			"response": []
		},
		{
			"name": "update products",
			"request": {
				"auth": {
					"type": "bearer",
					"bearer": [
						{
							"key": "token",
							"value": "eyJhbGciOiJIUzI1NiIsInR5cCI6IkpXVCJ9.eyJpZCI6IjY0MDYwMjlhZmJlNzk1NzQ0YTE5ZmIwOCIsImVtYWlsIjoicmlzaGlAMTIzIiwiaXNBZG1pbiI6dHJ1ZSwiaWF0IjoxNjc4NDY2MTQ5fQ.hjhlNFL-AbMneUw7hQvrEA_w1iNBgpg2AMQ72grVU5Y",
							"type": "string"
						}
					]
				},
				"method": "PUT",
				"header": [],
				"body": {
					"mode": "raw",
					"raw": "{\r\n\"name\": \"jamsung\",\r\n\"description\": \"xyz\",\r\n\"price\": 75000\r\n}",
					"options": {
						"raw": {
							"language": "json"
						}
					}
				},
				"url": {
					"raw": "localhost:4000/products/update/640b50fe9d24e411c2283e7a",
					"host": [
						"localhost"
					],
					"port": "4000",
					"path": [
						"products",
						"update",
						"640b50fe9d24e411c2283e7a"
					]
				}
			},
			"response": []
		},
		{
			"name": "chechout emails",
			"request": {
				"method": "GET",
				"header": []
			},
			"response": []
		},
		{
			"name": "get user details by id",
			"protocolProfileBehavior": {
				"disableBodyPruning": true
			},
			"request": {
				"auth": {
					"type": "bearer",
					"bearer": [
						{
							"key": "token",
							"value": "eyJhbGciOiJIUzI1NiIsInR5cCI6IkpXVCJ9.eyJpZCI6IjY0MGI1MDZiOWQyNGU0MTFjMjI4M2U3NyIsImVtYWlsIjoicmFtQDEyMyIsImlzQWRtaW4iOmZhbHNlLCJpYXQiOjE2Nzg0NjM2NzV9.RGE1blhzQNPduE90QNEGhh4OWs--eKrnigComj2RVdk",
							"type": "string"
						}
					]
				},
				"method": "GET",
				"header": [],
				"body": {
					"mode": "raw",
					"raw": "",
					"options": {
						"raw": {
							"language": "json"
						}
					}
				},
				"url": {
					"raw": "localhost:4000/users/640b506b9d24e411c2283e77/userDetails",
					"host": [
						"localhost"
					],
					"port": "4000",
					"path": [
						"users",
						"640b506b9d24e411c2283e77",
						"userDetails"
					]
				}
			},
			"response": []
		},
		{
			"name": "checkout functionality",
			"request": {
				"auth": {
					"type": "bearer",
					"bearer": [
						{
							"key": "token",
							"value": "eyJhbGciOiJIUzI1NiIsInR5cCI6IkpXVCJ9.eyJpZCI6IjY0MGIyYWJkY2E4ODZmZjgzYzg5M2NiZCIsImVtYWlsIjoiYXR1bEAxMjMiLCJpc0FkbWluIjpmYWxzZSwiaWF0IjoxNjc4NDUzNDg1fQ.eoKS66iqFigSn4HpLibLiqiv1YHx8_tC1QaL57vqVg4",
							"type": "string"
						}
					]
				},
				"method": "POST",
				"header": [],
				"body": {
					"mode": "raw",
					"raw": "{ \r\n    \"userId\": \"640b2abdca886ff83c893cbd\",\r\n    \"products\" : \r\n    {[  \"id\":\"64074dc37981db99028caf4c\",\r\n        \"quantity\": \"1\"]},\r\n    \"totalAmount\":\"75000\"    \r\n\r\n    \r\n\r\n\r\n\r\n}",
					"options": {
						"raw": {
							"language": "json"
						}
					}
				},
				"url": {
					"raw": "localhost:4000/users/checkOut",
					"host": [
						"localhost"
					],
					"port": "4000",
					"path": [
						"users",
						"checkOut"
					]
				}
			},
			"response": []
		},
		{
			"name": "archieve Products",
			"request": {
				"auth": {
					"type": "bearer",
					"bearer": [
						{
							"key": "token",
							"value": "eyJhbGciOiJIUzI1NiIsInR5cCI6IkpXVCJ9.eyJpZCI6IjY0MDYwMjlhZmJlNzk1NzQ0YTE5ZmIwOCIsImVtYWlsIjoicmlzaGlAMTIzIiwiaXNBZG1pbiI6dHJ1ZSwiaWF0IjoxNjc4NDY2MTQ5fQ.hjhlNFL-AbMneUw7hQvrEA_w1iNBgpg2AMQ72grVU5Y",
							"type": "string"
						}
					]
				},
				"method": "PUT",
				"header": [],
				"body": {
					"mode": "raw",
					"raw": "{\r\n    \"isAactive\":false\r\n}",
					"options": {
						"raw": {
							"language": "json"
						}
					}
				},
				"url": {
					"raw": "localhost:4000/products/640b50fe9d24e411c2283e7a/archieve",
					"host": [
						"localhost"
					],
					"port": "4000",
					"path": [
						"products",
						"640b50fe9d24e411c2283e7a",
						"archieve"
					]
				}
			},
			"response": []
		}
	]
}