{
	"_id":"507f1f77bcf86cd799439011",
	"firstName": "Tony",
	"lastName": "Stark",
	"email": "tonystark@gmail.com",
	"password": "tonyst",
	"isAdmin": false,
	"mobileNumber": "09991231234",
}

{
	"_id":"507f1f77bcf86cd799439011",
	"firstName": "Steve",
	"lastName": "Rogers",
	"email": "steverog@mail.com",
	"password": "stever",
	"isAdmin": true,
	"mobileNumber": "09927382393",
	"enrollments": [], // It will contain the id of the courses this user is enrolled to
	"dateTimeRegistered": "2020-03-15T15:00:00.00Z"
}