{
	"info": {
		"_postman_id": "58af272e-a2b7-41f2-9073-460f92793150",
		"name": "s38 course booking",
		"schema": "https://schema.getpostman.com/json/collection/v2.1.0/collection.json",
		"_exporter_id": "24988338"
	},
	"item": [
		{
			"name": "check emails",
			"request": {
				"method": "GET",
				"header": []
			},
			"response": []
		},
		{
			"name": "user registeration",
			"request": {
				"method": "GET",
				"header": []
			},
			"response": []
		},
		{
			"name": "user Authentication",
			"request": {
				"method": "GET",
				"header": []
			},
			"response": []
		},
		{
			"name": "get details by id",
			"request": {
				"method": "GET",
				"header": []
			},
			"response": []
		}
	]
}