{
	"info": {
		"_postman_id": "91e98576-af17-4d3b-9140-7276d564f2d4",
		"name": "activity35",
		"schema": "https://schema.getpostman.com/json/collection/v2.1.0/collection.json",
		"_exporter_id": "24216228"
	},
	"item": [
		{
			"name": "signup",
			"request": {
				"method": "POST",
				"header": [],
				"body": {
					"mode": "raw",
					"raw": "{\r\n    \"username\": \"John\",\r\n    \"password\": \"johndoe\"\r\n}",
					"options": {
						"raw": {
							"language": "json"
						}
					}
				},
				"url": {
					"raw": "http://localhost:6000/signup",
					"protocol": "http",
					"host": [
						"localhost"
					],
					"port": "6000",
					"path": [
						"signup"
					]
				}
			},
			"response": []
		}
	]
}