{
	"_id":"OR1001",
	"userId":"CX01v11am4",
	"transactionDate":"2022-11-24-1122AM",
	"status":"pending",
	"total": "14000"
},
{
	"_id":"OR1002",
	"userId":"CX02r2t5m6",
	"transactionDate":"2022-11-24-1124AM",
	"status":"for delivery",
	"total": "3500"
}