---------------User---------------
Aljohn - 639044a27cce40497d287427
email - "aljohn@mail.com"
password - "user123"
admin: true

John - 63904ca2b563e9b30c575aba
email - "john@mail.com
password - "user123"
admin: false

Johnny - 6392fbd0e58caa419787076f
email - "johnny@mail.com"
password - "user123"
admin: false


---------------Product---------------
Oversized Shirt - 63906896d9ee05d9905e944b
Polo Shirt - 63906e43b291de41cbb9a5ed
Hoodies - 63906e6db291de41cbb9a5f0



