{
	"_id": "product123",
	"name": "Cute pig sippy cup for infants and toddlers with handle",
	"description": "Designed to mimic breastfeeding to help babies easily transition back and forth from nursing to bottle-feeding",
	"price": 119,
	"stocks": 713,
	"isActive": true,
	"SKU": "sppnfnpnk280pp",
	"orderProductsID": ["orderProd111"]
},
{
	"_id": "product456",
	"name": "Toddler Girls Beach Pool Slides Sandals Home Animal Slippers Soft Shoe",
	"description": "Princess Sneakers with Soft Rubber bottom soles for better control of movement and comfort. Soft Material will not hurt your girls' feet even for a long day to play or to walk. Hook & Loop",
	"price": 98,
	"stocks": 767,
	"isActive": true,
	"SKU": "flpnfnpnksmlrbb",
	"orderProductsID": ["orderProd113", "orderProd114"]
},
{
	"_id": "product789",
	"name": "Roblox T-shirt for Kids Boys Game Cartoon Printed Shirts Clothes [6-12 Years Old]",
	"description": "Learn how to create a simple music library using PHP",
	"price": 120,
	"stocks": 1173,
	"isActive": true,
	"SKU": "shrrblnsxfrsply",
	"orderProductsID": ["orderProd112", "orderProd115"]
}