{
	"_id": "prodch-0001",
	"userId": "F6aC792a5B2Z",
	"transactionDate": "2022-11-24-0935AM",
	"status": "paid"
},
{
	"_id": "prodta-0001",
	"userId": "F6aC792a5B2Z",
	"transactionDate": "2022-11-24-0937AM",
	"status": "paid"
}

